program: Gaussian 09
title: 000232121
version: EM64L-G09RevD.01
frameworkgroup: C1[X(C11H13NO2)]
method: RPBEPBE
basis: SDD
operation: Freq
keyword: #p
keyword: freq=noraman
keyword: PBEPBE/SDD
title: #p freq=noraman PBEPBE/SDD
converged: YES YES NO NO
title: Mulliken charges:
elementType: O O N C C C C C C C C C C C H H H H H H H H H H H H H
charge: -0.317452 -0.275168 -0.460561 0.478412 -0.451992 0.571561 -0.441807 -0.356144 -0.195411 -0.209726 0.273563 -0.256948 -0.799194 -0.722750 0.231730 0.249298 0.222774 0.298598 0.330566 0.226838 0.226731 0.229251 0.235573 0.236489 0.227493 0.222939 0.225337
chargesum: 0.00000
title: Mulliken charges with hydrogens summed into heavy atoms:
elementType: O O N C C C C C C C C C C C
charge: -0.317452 -0.275168 -0.129995 0.478412 0.029036 0.571561 -0.219033 -0.057546 0.031427 0.017006 0.273563 -0.027697 -0.099639 -0.274473
polarizability: 2.17075624e+02 9.55998187e+00 1.18620313e+02 1.38835663e+01 -1.37937782e+00 7.70590581e+01
1716.lowfreq: -9.6412 -6.7841 -0.0006 -0.0003 0.0004 3.5961 25.7731 35.4330 54.0663
frequency: 25.4494 35.3263 53.9183 68.7334 89.1909 129.4057 175.1027 225.4426 254.6791 271.9377 294.9034 342.4417 396.7149 408.1394 431.0466 509.5403 529.8212 604.8254 617.2384 645.4880 673.2701 695.3985 699.0063 704.7041 766.4873 816.0541 831.6642 842.3593 889.1879 914.1802 952.2844 965.9216 972.0261 974.2650 984.6013 996.4769 996.8338 1028.9592 1034.1620 1071.7117 1090.7285 1157.8252 1172.9785 1191.1563 1240.5029 1258.6659 1304.9274 1327.0631 1348.6975 1386.1591 1394.9155 1431.4293 1434.3213 1452.9064 1464.3356 1478.4039 1486.0955 1516.4302 1601.0211 1617.1806 1665.9592 1673.6465 2975.3505 3003.7616 3052.2609 3090.9614 3092.4380 3095.5004 3115.0070 3132.9207 3145.0187 3165.7730 3189.2680 3194.6517 3539.9586
redmass: 3.8233 4.1597 3.0265 7.5215 5.0243 3.4344 1.1209 4.6542 4.5402 4.5905 4.5693 6.6863 2.1218 2.9248 2.1987 2.8573 3.6065 4.8323 4.9811 1.3544 4.1819 2.6342 2.9959 1.3668 1.6637 3.4989 4.2440 1.2648 6.2679 1.4299 1.3725 1.5492 1.3549 1.8999 5.4161 1.5353 2.5380 2.0337 1.5850 1.7971 1.5638 3.4176 1.0506 1.1122 1.1648 2.0743 2.7270 1.3947 1.2672 6.8987 1.2507 1.3251 1.8931 1.0751 1.0760 1.0688 2.2170 2.2379 5.3021 6.0073 8.1250 5.1147 1.0370 1.0606 1.0966 1.0701 1.0935 1.1021 1.0881 1.0870 1.0935 1.0996 1.0954 1.1140 1.0760
irintensity: 0.1562 1.1170 0.6305 3.2234 1.0945 2.1817 1.0702 1.3247 5.7083 7.4382 10.1070 4.9495 4.7773 0.0081 9.4620 25.8721 11.3089 1.2524 0.8307 25.2207 10.6804 0.5984 83.5863 3.0658 108.2056 10.1225 12.7179 0.4269 2.9627 14.5771 101.7404 12.1854 0.0726 37.5949 7.3567 73.9820 255.2110 7.9390 1.9865 16.1205 32.5875 402.3142 0.5638 3.5331 6.0889 6.3709 1.2834 49.6132 5.8825 51.1677 19.7426 22.4445 102.3182 4.7275 36.3923 44.3543 14.0577 534.5144 28.9895 104.0875 220.3389 25.0799 17.3999 31.1428 18.0401 17.5714 22.5666 12.7453 13.5266 0.7152 31.3534 23.2979 5.8366 21.2984 30.1357
temp: 298.150 k
press: 1.00000 atm
elementType: 8 8 7 6 6 6 6 6 6 6 6 6 6 6 1 1 1 1 1 1 1 1 1 1 1 1 1
symmnumber: 1
zpe: 570661.3 jmol-1
zpe.correction: 0.217353 hartree
zpe.thermalcorrener: 0.231062 hartree
zpe.thermalcorrenthalpy: 0.232006 hartree
zpe.thermalcorrgfe: 0.174945 hartree
zpe.sumelectzpe: -631.135714 hartree
zpe.sumelectthermal: -631.122005 hartree
zpe.sumelectthermalent: -631.121061 hartree
zpe.sumelectthermalfe: -631.178122 hartree
dipole: -0.2184 -1.9015 0.4565
dipole: 1.9677
quadrupole: -71.0623 -80.4729 -84.2327
quadrupole: -0.7483 1.6055 1.0153
quadrupole: 7.5270 -1.8836 -5.6434 -0.7483 1.6055 1.0153
hfenergy: -631.353067 hartree
pointgroup: C01 [X(C11H13N1O2)]
dipole: 0.0843222 0.6631149 -0.390499 debye
polarizability: 215.1000287|-6.3522489|100.3977002|-22.5111717|-20.0237119|97.2572658 unknown
InChI: InChI=1S/C11H13NO2/c1-9(2)8-14-11(13)12-10-6-4-3-5-7-10/h3-7,12H,1,8H2,2H3
charge 0 multiplicity 1
27 atoms
O  1.851487 0.012844 -1.043109
O  0.729737 -1.432446 0.457061
N  -0.347316 0.345775 -0.687358
C  -1.694414 0.255772 -0.238642
C  3.135298 -0.715735 -0.802657
C  4.103391 0.153273 -0.024935
C  -2.613576 1.214057 -0.744655
C  -2.139211 -0.735725 0.675285
C  -3.963867 1.182535 -0.342229
C  -3.495216 -0.751963 1.067653
C  0.722864 -0.457998 -0.336063
C  -4.415115 0.198263 0.56797
C  3.630485 0.6316 1.333101
C  5.332124 0.433887 -0.533182
H  3.521351 -0.962912 -1.804525
H  2.890295 -1.641008 -0.246346
H  -2.27075 1.981288 -1.450846
H  -1.430448 -1.470778 1.062057
H  -0.12281 1.085636 -1.356586
H  -4.662058 1.927264 -0.740079
H  -3.833098 -1.519633 1.772942
H  -5.464157 0.173398 0.880944
H  3.307511 -0.219647 1.962524
H  2.75332 1.298053 1.227869
H  4.420651 1.186331 1.866063
H  5.6395 0.085749 -1.526815
H  6.068424 1.014519 0.033957
