program: Gaussian 09
title: 000021996
version: EM64L-G09RevD.01
frameworkgroup: C1[X(C5H10N2)]
method: RPBEPBE
basis: SDD
operation: Freq
keyword: #pfreq=noraman
keyword: PBEPBE/SDD
title: #p freq=noraman PBEPBE/SDD
converged: YES YES NO NO
title: Mulliken charges:
elementType: N N C C C C C H H H H H H H H H H
charge: -0.123109 0.000901 -0.026100 -0.489533 -0.691817 -0.300542 -0.616139 0.210809 0.225880 0.226506 0.229293 0.217115 0.214322 0.247521 0.252590 0.218466 0.203836
chargesum: 0.00000
title: Mulliken charges with hydrogens summed into heavy atoms:
elementType: N N C C C C C
charge: -0.123109 0.000901 0.184709 -0.037147 -0.031087 -0.053021 0.058754
polarizability: 8.12278163e+01 1.94713783e+00 6.80218200e+01 2.54284355e-01 1.26160025e+00 4.89400194e+01
1716.lowfreq: -17.2539 -13.7502 -0.0008 -0.0006 0.0005 18.3494 100.2236 186.4376 192.7157
frequency: 100.1660 186.4284 192.6857 216.4475 266.4533 375.8711 430.6291 523.6990 587.4215 707.0102 752.9987 808.4964 866.3049 903.6401 938.5201 959.2531 1036.7058 1076.2964 1113.2809 1121.5055 1148.6190 1205.3189 1238.7099 1249.9179 1260.2026 1330.2909 1333.7072 1387.0929 1425.3903 1455.0741 1463.7323 1470.2833 1475.4011 1482.2532 1534.6673 2879.3474 2907.8556 2965.5430 2983.7654 3047.5595 3061.4698 3076.2387 3090.7852 3113.7528 3196.6288
redmass: 2.4548 1.2664 1.0951 1.7985 2.5000 2.5939 2.2287 4.1732 4.1180 3.3740 1.1458 5.6650 2.3741 1.5060 2.4019 2.0617 1.6890 1.5830 1.4775 1.8580 1.6871 1.7366 2.5080 1.4654 1.7888 1.5070 1.5953 1.2300 1.1562 1.1202 1.0538 1.0489 1.0498 1.0534 6.0291 1.0832 1.0533 1.0676 1.0357 1.0795 1.0950 1.0990 1.1002 1.0992 1.0953
irintensity: 3.2883 2.4307 1.5585 7.3814 1.7601 4.0301 1.4030 10.5704 11.1123 6.1863 29.8520 9.2750 27.3726 14.8361 16.1040 19.2764 5.0156 5.1834 9.6999 1.4118 14.4462 0.8179 14.9387 15.3547 21.8964 8.2902 12.6619 16.2989 5.9799 8.6869 11.5373 23.2020 4.4574 12.9784 24.4797 57.7953 127.9162 33.7588 28.2999 35.6351 22.8761 29.1922 35.4930 15.0158 6.4130
temp: 298.150 k
press: 1.00000 atm
elementType: 7 7 6 6 6 6 6 1 1 1 1 1 1 1 1 1 1
symmnumber: 1
zpe: 382490.5 jmol-1
zpe.correction: 0.145683 hartree
zpe.thermalcorrener: 0.153126 hartree
zpe.thermalcorrenthalpy: 0.154070 hartree
zpe.thermalcorrgfe: 0.114468 hartree
zpe.sumelectzpe: -305.425144 hartree
zpe.sumelectthermal: -305.417701 hartree
zpe.sumelectthermalent: -305.416757 hartree
zpe.sumelectthermalfe: -305.456359 hartree
dipole: -0.6388 2.2321 1.1652
dipole: 2.5977
quadrupole: -38.9774 -45.4926 -44.6105
quadrupole: 2.9428 -0.1523 -0.8015
quadrupole: 4.0495 -2.4658 -1.5837 2.9428 -0.1523 -0.8015
hfenergy: -305.5708266 hartree
pointgroup: C01[X(C5H10N2)]
dipole: -0.7245458 0.5745086 0.4353198 debye
dipolederiv: -0.7988734 -0.5779519 -0.06546 0.0988837 -0.2838272 0.0441908 -0.1711826 -0.1687558 -0.3861939 0.4542038 0.6197039 0.098952 0.3571112 -0.243152 0.0324311 0.0714396 0.1106409 -0.1621108 0.2166776 -0.1355625 -0.0129923 -0.2193115 0.1093543 0.0176054 -0.0232833 0.0516858 0.4182015 -0.2178069 0.0375564 0.0473979 -0.0003487 -0.066152 -0.0209907 0.0826577 -0.0269414 0.2537011 -0.0585146 0.061072 -0.0417726 0.0566077 0.0659583 0.0156891 -0.0355715 0.011592 0.0389198 0.0982936 -0.2395493 -0.0549733 -0.4140383 -0.0078536 0.0399779 -0.1737152 -0.0541017 -0.2338033 0.1894483 0.2135546 -0.0080763 0.1974832 0.4271726 -0.130973 0.0516229 -0.1128018 0.3655805 -0.020734 0.0036278 0.0069542 0.0476118 0.0233492 0.0833181 0.0971595 0.0209649 -0.2408025 0.1000608 0.0090872 -0.0125636 -0.0196414 -0.0341392 -0.0885035 -0.019101 -0.1436175 -0.0276131 0.0871937 0.0909133 -0.0241383 -0.0026351 -0.013586 0.0761682 -0.0185479 0.1464413 -0.076121 0.0721481 -0.0109874 0.062852 -0.0080275 0.0842587 0.025829 -0.0124135 0.0445379 -0.1310607 -0.0464407 -0.0951319 0.0071187 -0.1644268 -0.0313039 0.0252479 0.010888 0.0385545 0.0812764 0.0220281 0.0595454 0.0126907 0.1234652 -0.0900837 -0.0755581 0.0308542 -0.0892587 0.0511867 -0.0809988 -0.0268355 0.0117097 -0.019477 0.0540316 -0.0099346 0.0544204 0.0036237 0.1712582 0.0696322 0.1255136 0.0570406 0.0473933 -0.0370034 -0.0500425 0.0498792 -0.0633761 0.06047 -0.14881 -0.0921613 -0.0646206 -0.0082448 0.0870121 0.0223943 -0.0634659 0.0335288 0.0581982 0.0624921 -0.0423945 -0.0201188 -0.072405 -0.0440359 -0.0068494 0.0683592 0.1972831 -0.2410872 unknown
polarizability: 74.8919591|6.8552887|74.4075188|-0.207928|0.8174974|48.8901777 unknown
InChI: InChI=1S/C5H10N2/c1-5-3-4-6-7(5)2/h4-5H,3H2,1-2H3
charge 0 multiplicity 1
17 atoms
N  -0.087997 -0.753711 -0.209425
N  1.32735 -0.658639 -0.193602
C  -0.692171 0.500028 0.375222
C  0.460798 1.528882 0.171507
C  -2.024531 0.877613 -0.288491
C  1.660917 0.601847 0.01534
C  -0.61501 -2.053981 0.217745
H  -0.85371 0.336406 1.468984
H  0.559126 2.240241 1.00896
H  0.300544 2.119706 -0.754631
H  -1.882738 1.014383 -1.374898
H  -2.789745 0.094933 -0.13572
H  -2.417608 1.818801 0.137744
H  2.70998 0.900353 -0.021826
H  -0.026071 -2.847533 -0.267809
H  -1.667574 -2.151869 -0.099498
H  -0.56106 -2.198559 1.321797
