program: Gaussian 09
title: 000232126
version: EM64L-G09RevD.01
frameworkgroup: C1[X(C9H9Br2NO2)]
method: RPBEPBE
basis: SDD
operation: Freq
keyword: #p
keyword: freq=noraman
keyword: PBEPBE/SDD
title: #p freq=noraman PBEPBE/SDD
converged: YES YES NO NO
title: Mulliken charges:
elementType: Br Br O O N C C C C C C C C C H H H H H H H H H
charge: 0.007836 -0.013355 -0.298740 -0.267112 -0.462426 0.491785 -0.435331 -0.341755 -0.192815 -0.150251 -0.160626 -0.238071 0.275579 -0.667614 0.233339 0.305557 0.338620 0.242369 0.262874 0.251291 0.250448 0.276982 0.291415
chargesum: 0.00000
title: Mulliken charges with hydrogens summed into heavy atoms:
elementType: Br Br O O N C C C C C C C C C
charge: 0.007836 -0.013355 -0.298740 -0.267112 -0.123806 0.491785 -0.201992 -0.036198 0.312427 0.101040 0.089823 -0.238071 0.275579 -0.099216
polarizability: 2.38471862e+02 7.54230435e+00 1.25572867e+02 7.63589578e+00 -7.70824126e+00 7.72153914e+01
1716.lowfreq: -5.0816 -2.8095 -0.0005 -0.0004 -0.0003 2.6770 13.4262 28.5885 43.5996
frequency: 12.9599 28.5810 43.5956 67.6290 77.3502 111.4082 162.1232 171.5403 204.1944 248.5825 266.0895 322.8371 356.0170 380.8558 410.1275 417.9445 509.3944 535.2280 619.4617 633.4374 642.9631 697.3394 705.8213 709.3674 794.6648 817.3463 845.1608 848.8181 927.6800 944.3179 960.9747 980.1226 988.7871 1004.0802 1063.3068 1085.7868 1119.5117 1160.0726 1168.7729 1190.1545 1211.1679 1261.6231 1274.1597 1298.5595 1356.2566 1373.1913 1401.4885 1432.4678 1458.3529 1475.0924 1512.3062 1591.9514 1607.0177 1668.9507 2987.5831 3062.5597 3074.4610 3126.9362 3149.1702 3165.5177 3172.4800 3191.6287 3541.5669
redmass: 8.4060 7.4613 9.6681 7.1194 5.7051 7.4081 5.7450 7.2153 6.8552 2.6191 6.0504 5.6094 5.7042 5.5061 2.9829 3.9563 2.7340 3.9728 7.0881 6.7814 1.3571 4.7586 3.7428 4.6405 3.5404 1.3852 1.4120 3.2115 2.6262 1.3596 1.9457 1.3263 4.7141 3.0045 2.4981 2.9432 1.3532 2.7409 1.3375 1.1106 1.1944 2.0932 1.1897 1.3333 1.7791 2.9420 3.7211 1.1144 1.0835 2.2791 2.3630 5.1963 6.1401 8.7656 1.0621 1.0653 1.0928 1.0903 1.1098 1.0907 1.0952 1.0957 1.0763
irintensity: 1.2805 1.7396 0.4587 2.5155 3.3852 0.6886 3.5989 2.2363 2.6592 3.9535 17.3606 0.0207 3.7575 2.0606 0.0116 26.8099 41.4595 17.8440 6.1440 11.0158 36.6757 41.7869 2.4191 13.5394 1.9879 43.1611 60.5764 1.5995 6.0807 1.6725 66.1966 2.1961 94.5441 133.1325 49.8569 127.3655 35.5602 406.7157 74.3881 13.4469 9.0312 4.7387 39.3674 15.6547 78.7185 42.4510 36.6430 14.8076 38.1055 62.5034 642.6321 41.0464 47.3536 259.2868 23.9714 10.0086 15.5715 13.3016 5.4909 3.5688 3.3120 5.3569 35.0999
temp: 298.150 k
press: 1.00000 atm
elementType: 35 35 8 8 7 6 6 6 6 6 6 6 6 6 1 1 1 1 1 1 1 1 1
symmnumber: 1
zpe: 434417.3 jmol-1
zpe.correction: 0.165461 hartree
zpe.thermalcorrener: 0.179591 hartree
zpe.thermalcorrenthalpy: 0.180535 hartree
zpe.thermalcorrgfe: 0.119312 hartree
zpe.sumelectzpe: -579.461673 hartree
zpe.sumelectthermal: -579.447544 hartree
zpe.sumelectthermalent: -579.446599 hartree
zpe.sumelectthermalfe: -579.507822 hartree
dipole: 2.3675 -0.0642 2.2534
dipole: 3.2691
quadrupole: -107.5003 -96.7117 -100.4363
quadrupole: 10.6113 6.3904 -1.8845
quadrupole: -5.9509 4.8377 1.1132 10.6113 6.3904 -1.8845
hfenergy: -579.6271341 hartree
pointgroup: C01 [X(C9H9Br2N1O2)]
dipole: -0.9462927 -0.2825345 -0.8239591 debye
dipolederiv: -0.8117236 -0.0315978 -0.051078 -0.0509331 -0.0689463 -0.00942 -0.0612131 -0.0084431 -0.0435666 -0.2039439 -0.0606474 0.0255933 -0.1640607 -0.3074642 0.1293582 0.1211298 0.176746 -0.2709506 -2.3366994 -0.0737021 -0.0354339 -0.2724184 -0.4397019 -0.0550925 -0.2269445 -0.0639607 -0.3054079 -0.8091649 -0.0254051 -0.000764 0.2696281 -0.9423199 -0.1096595 0.0043422 -0.1408141 -0.352259 -2.1293346 0.2699388 0.0050776 0.7333353 -0.4692492 -0.0094043 0.0353126 -0.0232497 -0.3274123 1.5618211 -0.0568566 0.050861 0.2099208 -0.0014851 -0.0156708 0.1441356 -0.0259842 0.1079714 -0.2719475 0.0071315 0.0046402 0.1363613 0.0281892 0.0576962 0.0218054 0.0464713 -0.1895009 -0.2718905 0.0137642 0.0016165 -0.152566 -0.0427866 0.0194999 -0.0402402 0.0276018 -0.1567487 1.0899648 -0.0707825 -0.0596848 -0.555718 0.1219292 0.0574201 0.0381997 0.0893887 0.2036061 -0.2582428 -0.054603 -0.021414 -0.0668297 0.0651183 0.025665 -0.0264168 0.0259927 -0.0734093 -0.2743151 0.0257747 -0.0060279 0.0169686 0.0872108 0.0344418 -0.00906 0.0376778 -0.072252 1.2731932 0.0844184 0.1058011 0.0991748 -0.0649487 0.0234844 0.1150336 0.0230246 -0.1367684 2.9388664 -0.1031196 0.0307008 -0.5997925 1.3861276 0.1910015 0.1108445 0.2414898 0.3541846 0.1042966 0.1142636 -0.0991675 0.2577369 0.4444997 -0.3261358 -0.217829 -0.334997 0.4050136 -0.0052226 -0.1005222 -0.0336809 -0.0860589 -0.0319922 -0.0481668 -0.0298062 -0.0483722 0.1577122 0.1485687 0.0443202 0.0028505 0.0197205 0.0712946 -0.0236927 0.0020773 -0.0201289 0.1750817 0.203401 0.041985 -0.0037709 -0.0064024 0.1631833 -0.0254312 -0.0099139 -0.0250237 0.3178939 -0.0912846 -0.0742097 0.0586354 0.1002074 -0.0192032 0.0965586 -0.0318815 0.0870536 0.0081009 -0.0257456 -0.0033644 -0.0214823 0.117827 0.0644292 -0.0542095 0.0154367 -0.0823677 -0.0377896 0.0423875 0.0747076 0.0089823 0.0760683 0.005731 -0.028068 0.0085733 -0.0274684 0.1555956 0.0626717 -0.0545421 -0.0173927 -0.064699 -0.0078164 -0.0387915 -0.0199713 -0.0385919 0.1467364 -0.0578347 0.0384318 0.0109244 0.053099 -0.0359292 0.081902 0.0249346 0.0804105 0.0430417 0.1221788 -0.0053832 0.0442138 -0.0705693 -0.0058702 0.0267147 0.0314513 0.0035448 -0.1088727 unknown
polarizability: 239.1676984|2.9867303|126.3987552|2.6046079|-2.2402523|75.6936668 unknown
InChI: InChI=1S/C9H9Br2NO2/c10-5-6-14-9(13)12-8-3-1-7(11)2-4-8/h1-4,12H,5-6H2
charge 0 multiplicity 1
23 atoms
Br 5.735602 0.070465 0.25908
Br -5.347266 -1.405832 1.076012
O  -2.649396 -0.095611 -0.368955
O  -1.267033 1.739134 0.155849
N  -0.423059 -0.442465 -0.262173
C  0.981565 -0.272767 -0.130592
C  1.801223 -1.417228 -0.317988
C  1.580412 0.97755 0.175413
C  -3.823439 0.783667 -0.190857
C  3.202815 -1.322375 -0.204329
C  2.983821 1.07142 0.28874
C  3.783259 -0.073365 0.098555
C  -1.403444 0.523682 -0.125707
C  -5.0662 -0.057686 -0.409703
H  1.348184 -2.388052 -0.552903
H  0.953639 1.859025 0.32378
H  -0.769303 -1.381124 -0.473644
H  -3.784559 1.593333 -0.947458
H  -3.795417 1.244277 0.811961
H  3.827076 -2.208319 -0.349673
H  3.443958 2.034997 0.525107
H  -5.969812 0.570633 -0.402403
H  -5.008224 -0.649658 -1.33481
