program: Gaussian 09
title: 000232146
version: EM64L-G09RevD.01
frameworkgroup: C1[X(C17H13F2N5O2)]
method: RPBEPBE
basis: SDD
operation: Freq
keyword: #p
keyword: freq=noraman
keyword: PBEPBE/SDD
title: #p freq=noraman PBEPBE/SDD
converged: NO YES NO NO
title: Mulliken charges:
elementType: F F O O N N N N N C C C C C C C C C C C C C C C C C H H H H H H H H H H H H H
charge: -0.201356 -0.201300 -0.205579 -0.285028 -0.456189 -0.406630 -0.121123 -0.118714 0.043384 0.209976 0.024444 0.191012 -0.026437 0.430663 0.453702 -0.742817 -0.403817 -0.280944 -0.414395 -0.271843 -0.345924 -0.380012 0.320854 -0.345270 -0.378805 0.317955 0.359199 0.340894 0.255012 0.242136 0.253642 0.252721 0.298919 0.237156 0.309785 0.261292 0.260821 0.260968 0.261648
chargesum: 0.00000
title: Mulliken charges with hydrogens summed into heavy atoms:
elementType: F F O O N N N N N C C C C C C C C C C C C C C C C C
charge: -0.201356 -0.201300 -0.205579 -0.285028 -0.096990 -0.065736 -0.121123 -0.118714 0.043384 0.209976 0.024444 0.191012 -0.026437 0.430663 0.453702 0.007974 -0.151096 0.017975 -0.177239 0.037942 -0.084632 -0.119191 0.320854 -0.084302 -0.117157 0.317955
polarizability: 4.17876649e+02 1.02588544e+01 3.31636123e+02 1.27665807e+01 -1.82887913e+01 1.00642893e+02
1716.lowfreq: -4.8638 -2.8181 -0.0010 -0.0010 -0.0009 4.7878 16.2114 25.6816 30.0874
frequency: 16.0661 25.6633 30.0764 36.2026 51.6312 69.5533 84.9303 94.9136 141.3864 161.2613 180.7536 206.7138 223.4649 227.2647 245.6921 250.6818 286.7372 294.6461 320.8229 369.0477 372.9907 378.3481 392.3819 398.3938 411.2588 418.1863 429.2692 486.5349 512.0862 516.3500 523.0488 540.4881 572.9767 580.2028 623.1151 626.0674 646.7072 677.8884 694.1199 708.4512 709.3594 721.5323 737.6578 747.5101 768.5902 777.1263 787.8060 806.2606 813.6270 830.9386 835.7649 846.4070 852.2387 907.9907 934.8846 943.7609 951.6191 964.8732 984.0081 993.8480 1000.8246 1004.4659 1038.5718 1055.9657 1094.6049 1111.6520 1120.2763 1156.5549 1158.4066 1166.9361 1197.5707 1201.3401 1240.3964 1244.2573 1265.9954 1273.9366 1295.8805 1301.3772 1314.3135 1355.1798 1382.7416 1389.0150 1397.9691 1416.0733 1417.2703 1438.3344 1450.6037 1479.2918 1491.4821 1493.4755 1512.6002 1527.1195 1555.0006 1583.6377 1604.9291 1610.4347 1617.7763 1619.0980 3006.2800 3088.3241 3112.9565 3129.3935 3132.0452 3142.5614 3168.6878 3169.6629 3179.6974 3180.4885 3203.3177 3209.1259 3513.1313
redmass: 7.8771 4.2413 8.3024 6.9263 5.1866 6.1756 7.9396 6.8869 6.8181 8.0424 8.7271 6.5507 4.5998 7.6306 3.8360 1.3787 8.4878 8.7478 5.1047 6.2425 6.6663 5.9551 6.0477 5.5466 3.0505 3.2120 7.1575 7.7467 2.6135 2.9583 6.1031 7.5777 3.8764 6.4184 7.1466 7.1875 8.3545 2.2999 6.9351 3.9504 4.2973 2.5208 6.2471 6.9433 5.9779 4.8230 8.3027 1.2601 1.3540 1.7361 4.4516 1.5103 4.4996 1.1808 1.3543 1.3525 1.3369 4.6429 1.3434 3.0533 2.7871 2.4003 1.6025 3.3904 2.1071 1.3014 2.1000 1.4051 1.4942 4.9401 2.0647 1.9507 2.4335 5.8870 5.7946 2.8884 1.4524 1.4275 7.8254 4.0385 7.0743 5.1228 1.2983 3.7149 3.8006 1.4005 1.0514 3.2371 2.8417 3.0111 2.3658 7.0709 3.8608 3.5690 5.4546 3.6479 5.5636 4.4444 1.0366 1.0953 1.0810 1.1020 1.0905 1.0906 1.0916 1.0915 1.0955 1.0959 1.0949 1.0945 1.0751
irintensity: 1.5969 0.2229 0.1318 0.0039 0.0183 0.2624 0.9457 0.2134 2.8865 0.4168 1.2041 1.3843 0.5954 0.8926 0.6006 1.1258 2.2847 4.2081 7.0757 2.3917 1.5008 0.6891 3.4376 1.8626 0.1399 0.0800 9.1740 23.0901 52.9882 4.1206 26.4291 4.1016 0.1199 3.4892 1.1642 0.4706 1.1982 25.7912 5.1307 2.5564 1.2625 18.6381 6.6431 12.3400 14.4387 18.9375 15.2401 4.3758 19.2208 134.6762 16.5016 11.0630 5.5855 112.9887 0.9034 9.1960 1.5837 17.9629 2.6773 2.1268 3.4564 10.3167 5.3801 15.8912 103.6446 0.6284 108.1523 37.1199 117.5293 308.7583 44.0345 85.9291 6.8834 56.0047 34.2391 62.1964 47.7844 3.0852 166.6086 20.0606 0.7621 7.3642 73.7350 16.7556 6.2062 191.6643 18.2054 380.3437 230.3548 236.9978 198.0093 1052.4575 103.8882 263.9734 4.4809 89.7627 38.3514 122.7509 1.8809 4.4489 132.5817 16.6910 9.1835 5.8078 1.3887 2.4927 4.0287 3.0268 7.7503 0.9851 74.4325
temp: 298.150 k
press: 1.00000 atm
elementType: 9 9 8 8 7 7 7 7 7 6 6 6 6 6 6 6 6 6 6 6 6 6 6 6 6 6 1 1 1 1 1 1 1 1 1 1 1 1 1
symmnumber: 1
zpe: 733090.8 jmol-1
zpe.correction: 0.279220 hartree
zpe.thermalcorrener: 0.301004 hartree
zpe.thermalcorrenthalpy: 0.301948 hartree
zpe.thermalcorrgfe: 0.225652 hartree
zpe.sumelectzpe: -1277.627451 hartree
zpe.sumelectthermal: -1277.605667 hartree
zpe.sumelectthermalent: -1277.604723 hartree
zpe.sumelectthermalfe: -1277.681019 hartree
dipole: 1.6129 -3.0556 0.2434
dipole: 3.4637
quadrupole: -182.0793 -138.1620 -149.6111
quadrupole: -11.0187 3.1723 -5.4796
quadrupole: -25.4618 18.4555 7.0064 -11.0187 3.1723 -5.4796
hfenergy: -1277.9066709 hartree
pointgroup: C01 [X(C17H13F2N5O2)]
dipole: 0.7155525 1.1479606 -0.1650213 debye
polarizability: 415.5449637|-17.3534527|331.1423433|-17.7796321|-28.8508031|103.4683568 unknown
InChI: InChI=1S/C17H13F2N5O2/c1-10-15(24(25)26)16(21-13-6-2-11(18)3-7-13)23-17(20-10)22-14-8-4-12(19)5-9-14/h2-9,21-22H,1H3
charge 0 multiplicity 1
39 atoms
F  1.198328 -5.720998 -0.008489
F  6.227161 0.380843 0.200849
O  -5.179135 1.658139 0.022337
O  -4.484879 -0.476596 0.359357
N  -1.997237 -1.090453 0.150115
N  1.046397 2.529313 -0.242988
N  -0.440576 0.672388 -0.059828
N  -1.20008 2.990207 -0.269089
N  -4.21571 0.802529 0.128224
C  -1.740238 0.248193 0.028536
C  -2.839557 1.218108 0.000315
C  -2.497207 2.611162 -0.176613
C  -0.227748 2.00534 -0.182536
C  -1.11869 -2.207018 0.110273
C  2.325008 1.925674 -0.128182
C  -3.489091 3.745718 -0.268625
C  -1.613975 -3.41624 0.674593
C  0.160774 -2.196547 -0.507254
C  3.449963 2.739231 -0.441632
C  2.525098 0.587491 0.305133
C  -0.846059 -4.595797 0.637706
C  0.935873 -3.374004 -0.545675
C  0.420707 -4.547509 0.029891
C  4.75779 2.229873 -0.332187
C  3.833187 0.072793 0.41457
C  4.922272 0.899459 0.09224
H  -3.017896 -1.267385 0.297417
H  1.024749 3.543985 -0.385503
H  -4.182695 3.610221 -1.115727
H  -2.920668 4.680182 -0.388665
H  -4.127861 3.802242 0.629238
H  -2.602887 -3.42964 1.146189
H  0.535679 -1.278215 -0.958318
H  3.302461 3.773152 -0.775696
H  1.662629 -0.029816 0.55655
H  -1.214377 -5.530235 1.069755
H  1.919666 -3.385621 -1.023952
H  5.63071 2.843373 -0.571321
H  4.006211 -0.95304 0.75289
