program: Gaussian 09
title: 000232118
version: EM64L-G09RevD.01
frameworkgroup: C1[X(C9H20N2O3)]
method: RPBEPBE
basis: SDD
operation: Freq
keyword: #p
keyword: freq=noraman
keyword: PBEPBE/SDD
title: #p freq=noraman PBEPBE/SDD
converged: YES YES NO NO
title: Mulliken charges:
elementType: O O O N N C C C C C C C C C H H H H H H H H H H H H H H H H H H H H
charge: -0.308955 -0.439307 -0.303160 -0.123949 -0.354026 -0.432362 -0.359076 -0.371916 -0.607133 -0.620319 -0.053344 -0.306814 0.284888 -0.702280 0.214026 0.233878 0.200360 0.230160 0.217724 0.249495 0.352072 0.223971 0.228437 0.194342 0.194876 0.226117 0.232367 0.225173 0.235663 0.224353 0.234343 0.232702 0.217185 0.330508
chargesum: 0.00000
title: Mulliken charges with hydrogens summed into heavy atoms:
elementType: O O O N N C C C C C C C C C
charge: -0.308955 -0.108800 -0.303160 -0.123949 -0.001954 0.015542 0.071445 0.095303 0.039617 0.033041 0.171830 0.153202 0.284888 -0.018049
polarizability: 1.53605795e+02 1.82811802e+00 1.17516982e+02 -8.18849769e+00 8.20411504e-01 1.02350202e+02
1716.lowfreq: -18.5133 -6.8020 -0.0008 -0.0007 -0.0003 6.4695 21.6043 26.3398 36.7005
frequency: 20.6502 26.0213 36.4892 51.0804 63.4072 85.0622 95.3469 127.8799 198.5881 219.2653 235.4536 241.8523 250.8558 256.1486 298.9151 310.3557 325.1790 345.7528 353.1068 383.6720 399.1541 422.9644 439.7004 541.3716 599.8458 628.5590 690.1621 700.1125 739.3303 789.3364 815.3191 849.8371 891.0457 913.1073 927.7441 948.8720 995.0677 1012.5836 1028.1011 1032.4826 1066.2980 1079.0734 1092.0852 1118.8853 1125.3533 1139.0319 1157.0251 1166.8597 1190.9201 1225.4003 1235.1007 1254.3189 1264.0966 1269.7404 1286.9908 1336.1293 1346.1619 1355.9161 1363.9963 1369.8164 1378.1782 1389.1459 1418.2793 1441.8902 1452.6394 1453.2835 1461.0949 1463.4568 1466.2948 1470.7239 1474.0236 1476.3797 1478.8845 1482.4069 1488.4198 1672.4132 2858.3343 2865.0533 2879.6047 2983.2852 2991.6105 3007.4884 3013.8016 3019.3675 3023.0862 3031.4950 3051.3272 3053.0409 3080.3202 3083.0903 3085.8808 3088.2065 3093.5158 3101.3859 3519.5704 3540.4962
redmass: 3.9070 4.0254 3.4086 3.6619 4.3659 6.2807 3.1426 3.2026 2.0759 1.8993 1.7769 1.3591 1.3561 1.4054 3.0020 3.1745 1.2759 2.9509 2.0145 2.8183 2.4365 2.3395 2.0465 3.8979 2.7384 5.1049 2.6685 1.8339 1.6265 2.6992 2.9864 3.2055 2.7945 1.9292 1.7263 2.4115 2.1249 2.6458 1.6559 1.5502 1.9275 1.7531 1.4968 2.3259 3.9688 1.5496 2.2692 1.7099 1.8089 1.2868 1.6124 1.5877 2.3176 1.2750 1.1843 1.2700 1.3917 1.2680 1.2204 1.3080 1.3258 1.2377 1.1429 1.1716 1.0940 1.0762 1.0823 1.0593 1.1753 1.1028 1.0798 1.1743 1.0681 1.3095 1.0647 9.0287 1.0692 1.0559 1.0570 1.0364 1.0611 1.0608 1.0668 1.0857 1.0746 1.0739 1.0985 1.0870 1.1014 1.0977 1.1025 1.1008 1.1002 1.1042 1.0774 1.0659
irintensity: 0.4896 0.3542 0.4918 1.8295 5.9221 3.8009 0.2631 0.7916 1.8081 2.2202 0.4497 1.2957 1.4591 2.9562 8.6877 2.8132 87.8671 79.9737 0.9419 17.7063 12.4896 3.9767 7.6482 1.1626 8.2783 4.8662 111.1948 43.4074 24.4675 5.6499 10.7039 13.2691 15.0979 14.0104 3.7914 23.0348 47.3239 94.6742 235.6667 20.1345 14.7002 10.6675 25.6841 2.2144 80.3813 13.2655 8.8632 13.5526 63.0411 2.9182 70.7890 16.2395 22.9984 18.7631 64.0639 3.3519 3.6151 8.4336 12.2224 16.1083 0.3367 24.6006 7.7402 6.3666 19.4696 17.2944 31.3644 11.8751 24.3165 9.5932 45.8410 113.0241 24.2818 196.7950 13.6520 317.0324 48.6274 62.2127 255.2550 12.2022 37.4816 35.5784 34.0204 5.6323 35.2631 37.1669 53.3120 6.3757 26.6975 35.9556 34.6792 28.1064 32.6912 22.2428 107.4771 7.0932
temp: 298.150 k
press: 1.00000 atm
elementType: 8 8 8 7 7 6 6 6 6 6 6 6 6 6 1 1 1 1 1 1 1 1 1 1 1 1 1 1 1 1 1 1 1 1
symmnumber: 1
zpe: 769022.1 jmol-1
zpe.correction: 0.292905 hartree
zpe.thermalcorrener: 0.310226 hartree
zpe.thermalcorrenthalpy: 0.311170 hartree
zpe.thermalcorrgfe: 0.245553 hartree
zpe.sumelectzpe: -688.954761 hartree
zpe.sumelectthermal: -688.937440 hartree
zpe.sumelectthermalent: -688.936496 hartree
zpe.sumelectthermalfe: -689.002113 hartree
dipole: -4.2690 0.2377 0.5037
dipole: 4.3052
quadrupole: -82.9606 -90.3658 -84.7107
quadrupole: -6.4513 -0.6520 -1.1465
quadrupole: 3.0517 -4.3534 1.3016 -6.4513 -0.6520 -1.1465
hfenergy: -689.2476661 hartree
pointgroup: C01 [X(C9H20N2O3)]
dipole: 1.674849 -0.0031031 -0.2524956 debye
polarizability: 152.6545038|-3.7367938|117.8808241|-9.9770965|0.3315998|102.9376506 unknown
InChI: InChI=1S/C9H20N2O3/c1-8(12)7-14-9(13)10-5-4-6-11(2)3/h8,10,12H,4-7H2,1-3H3
charge 0 multiplicity 1
34 atoms
O  -1.437519 0.796904 0.501516
O  -5.15786 1.321221 0.669152
O  -1.412848 -1.561772 0.7458
N  3.225732 0.689219 -0.150411
N  0.369062 -0.373294 -0.224612
C  2.397955 -1.570537 0.665349
C  2.969206 -0.180434 1.030355
C  1.280134 -1.507477 -0.41082
C  3.506371 2.08596 0.256106
C  4.294363 0.163888 -1.029607
C  -3.857007 1.115279 -0.007213
C  -2.798107 0.842833 1.083373
C  -0.858568 -0.494206 0.368085
C  -3.932471 0.014293 -1.075149
H  3.195728 -2.246543 0.300865
H  1.998561 -2.022159 1.593216
H  3.891667 -0.314129 1.651426
H  2.23196 0.34765 1.664007
H  1.733582 -1.411843 -1.413757
H  0.681547 -2.433937 -0.390938
H  0.750772 0.555197 -0.426574
H  3.617698 2.719629 -0.641839
H  2.663553 2.47898 0.852266
H  4.438217 2.186308 0.866917
H  5.287123 0.104799 -0.516817
H  4.401779 0.819405 -1.911971
H  4.036139 -0.8469 -1.388056
H  -3.654949 2.09251 -0.47824
H  -2.789318 1.67108 1.810271
H  -3.002827 -0.117397 1.594779
H  -4.752761 0.230376 -1.78162
H  -2.988226 -0.044569 -1.645023
H  -4.103511 -0.976765 -0.613542
H  -5.482879 0.442934 0.997102
