program: Gaussian 09
title: 000232099
version: EM64L-G09RevD.01
frameworkgroup: C1[X(C11H13Cl2NO3)]
method: RPBEPBE
basis: SDD
operation: Freq
keyword: #p
keyword: freq=noraman
keyword: PBEPBE/SDD
title: #p freq=noraman PBEPBE/SDD
converged: YES YES NO NO
title: Mulliken charges:
elementType: Cl Cl O O O N C C C C C C C C C C C H H H H H H H H H H H H H
charge: -0.057772 -0.039118 -0.300314 -0.436144 -0.301988 -0.342005 -0.055685 -0.580307 0.592537 -0.306260 -0.699461 -0.276977 -0.360462 0.314584 -0.209100 -0.221310 -0.096364 0.229076 0.257478 0.258570 0.243036 0.225766 0.238444 0.232267 0.213833 0.332575 0.267528 0.283088 0.262445 0.332041
chargesum: 0.00000
title: Mulliken charges with hydrogens summed into heavy atoms:
elementType: Cl Cl O O O N C C C C C C C C C C C
charge: -0.057772 -0.039118 -0.300314 -0.104103 -0.301988 -0.009430 0.173391 -0.064259 0.592537 0.162542 -0.014917 -0.276977 -0.092934 0.314584 0.073988 0.041135 -0.096364
polarizability: 1.76088468e+02 -2.13999031e+01 1.56572059e+02 -1.49122888e+01 -1.64832207e+01 1.26160294e+02
1716.lowfreq: -15.6600 -7.2757 0.0010 0.0013 0.0014 0.5810 12.0993 15.1335 29.3183
frequency: 11.5879 14.9010 29.2458 47.1082 56.7025 66.9580 101.6235 156.3407 163.5564 181.8110 203.3524 217.8489 238.7750 279.9905 290.0261 317.3506 324.0544 360.5282 369.4315 393.2499 419.8550 430.2540 436.4755 472.1479 541.3569 566.1322 587.3940 634.1131 638.2249 681.4094 696.9907 734.9099 808.3857 815.8580 832.6528 846.3521 864.1974 912.2372 925.1404 952.7115 963.8071 999.8657 1023.0287 1027.0443 1083.3323 1098.8837 1120.8086 1142.9275 1158.1307 1195.9705 1205.7720 1224.0434 1246.4598 1267.0590 1277.3455 1335.3399 1351.9261 1361.9592 1370.3629 1375.8624 1379.7115 1389.2951 1444.6500 1453.1969 1461.0761 1465.9549 1471.1454 1484.1868 1569.9939 1592.3407 1658.5530 2982.4560 3013.8400 3030.9258 3054.2575 3082.5334 3094.5356 3095.6920 3108.0609 3150.5878 3178.8184 3184.1757 3542.6171 3570.9724
redmass: 6.6022 8.0363 3.7406 4.7166 5.3752 7.5675 7.2341 5.1812 5.7800 11.3387 6.0889 1.2087 4.9929 3.1270 4.4138 1.1900 4.1747 5.6456 7.8309 3.3594 3.0460 3.0009 2.1577 5.0859 5.0597 1.1853 3.9708 4.9615 5.6063 5.8886 9.8959 4.7708 2.3226 2.9859 3.4404 2.1091 1.4039 1.8702 1.7498 2.4753 1.7470 2.5298 3.5810 1.6126 2.8056 5.2061 2.3356 1.3869 2.2769 2.0767 2.3922 1.2797 1.4778 1.2870 1.2879 1.2624 1.5341 1.2548 1.3391 4.3316 2.3360 1.2389 1.3834 1.0855 1.8122 1.0915 1.0547 1.6985 7.5167 7.3838 8.6276 1.0368 1.0609 1.0603 1.0872 1.0968 1.1001 1.1037 1.1052 1.0902 1.0960 1.0940 1.0660 1.0779
irintensity: 0.2654 0.6633 0.7164 1.6767 2.3637 7.9604 0.7076 2.5903 0.2740 0.9511 2.5883 1.2784 2.9597 4.8665 2.4060 114.8017 9.9037 24.7048 6.7027 33.0562 1.2681 10.1496 10.0745 5.9640 3.6748 151.0815 17.7732 14.2265 3.9587 13.4255 20.3827 9.7524 59.4605 10.8172 45.7288 21.7858 19.4944 17.8381 3.1154 51.1500 21.9104 40.2980 57.6150 140.2473 46.8140 135.4892 1.6166 6.7055 5.5471 194.2037 15.5078 2.9957 84.8382 23.7574 35.3802 2.1249 17.7008 9.2151 22.1130 3.3556 8.6497 17.8838 67.8062 9.1996 43.7038 15.4929 21.6571 369.4077 27.4058 54.1561 210.1876 10.9020 31.0597 22.9465 4.5180 38.5563 28.5156 1.6959 17.3503 1.1250 0.7480 1.0270 8.3088 38.8065
temp: 298.150 k
press: 1.00000 atm
elementType: 17 17 8 8 8 7 6 6 6 6 6 6 6 6 6 6 6 1 1 1 1 1 1 1 1 1 1 1 1 1
symmnumber: 1
zpe: 591617.6 jmol-1
zpe.correction: 0.225335 hartree
zpe.thermalcorrener: 0.243372 hartree
zpe.thermalcorrenthalpy: 0.244316 hartree
zpe.thermalcorrgfe: 0.174802 hartree
zpe.sumelectzpe: -1626.240488 hartree
zpe.sumelectthermal: -1626.222451 hartree
zpe.sumelectthermalent: -1626.221506 hartree
zpe.sumelectthermalfe: -1626.291021 hartree
dipole: 0.9223 0.6902 1.0214
dipole: 1.5396
quadrupole: -128.5085 -110.0777 -114.3862
quadrupole: 1.1868 -4.2031 -3.5431
quadrupole: -10.8510 7.5798 3.2712 1.1868 -4.2031 -3.5431
hfenergy: -1626.465823 hartree
pointgroup: C01 [X(C11H13Cl2N1O3)]
dipole: -0.4501877 0.0772272 -0.3978334 debye
polarizability: 163.3195352|16.2614092|167.5479283|-29.0469189|-2.0592604|127.9533575 unknown
InChI: InChI=1S/C11H13Cl2NO3/c1-7(15)6-17-11(16)14-5-8-2-3-9(12)4-10(8)13/h2-4,7,14-15H,5-6H2,1H3
charge 0 multiplicity 1
30 atoms
Cl -2.135733 2.478973 1.058354
Cl -3.923034 -2.684442 2.014378
O  2.84362 1.315503 -0.381635
O  5.827656 -0.76123 0.565846
O  1.786108 -0.176448 -1.887984
N  0.642447 1.597316 -0.864254
C  4.446492 -0.25058 0.709156
C  -0.666202 1.26324 -1.448492
C  -1.480169 0.299033 -0.59066
C  4.130635 0.593712 -0.54443
C  3.437515 -1.380265 0.958531
C  -2.188379 0.714841 0.560598
C  -1.537879 -1.080761 -0.915176
C  1.747675 0.817496 -1.114329
C  -2.93658 -0.162735 1.36724
C  -2.273081 -1.999622 -0.134604
C  -2.964468 -1.521193 0.994593
H  4.505986 0.412332 1.589171
H  -0.48221 0.805608 -2.434155
H  -1.221585 2.205161 -1.597212
H  4.896888 1.374613 -0.673157
H  4.072759 -0.044495 -1.446531
H  3.749058 -1.978817 1.8320
H  2.430959 -0.972235 1.15891
H  3.357064 -2.044149 0.076636
H  0.719659 2.351149 -0.180522
H  -0.980256 -1.435801 -1.788312
H  -3.474346 0.195815 2.24794
H  -2.305535 -3.060007 -0.398048
H  5.825738 -1.495312 -0.101551
