program: Gaussian 09
title: 000232067
version: EM64L-G09RevD.01
frameworkgroup: C1[X(C12H16N2O4)]
method: RPBEPBE
basis: SDD
operation: Freq
keyword: #p
keyword: freq=noraman
keyword: PBEPBE/SDD
title: #p freq=noraman PBEPBE/SDD
converged: YES YES NO NO
title: Mulliken charges:
elementType: O O O O N N C C C C C C C C C C C C H H H H H H H H H H H H H H H H
charge: -0.321727 -0.321726 -0.264931 -0.264932 -0.475142 -0.475142 0.283302 0.283302 -0.328813 -0.328813 -0.249760 -0.249760 0.267642 0.267642 -0.212511 -0.212511 -0.673156 -0.673156 0.299760 0.299760 0.312573 0.312573 0.228635 0.228635 0.230260 0.230254 0.230260 0.230254 0.229428 0.214762 0.229424 0.229423 0.229429 0.214763
chargesum: 0.00000
title: Mulliken charges with hydrogens summed into heavy atoms:
elementType: O O O O N N C C C C C C C C C C C C
charge: -0.321727 -0.321726 -0.264931 -0.264932 -0.162569 -0.162569 0.283302 0.283302 -0.029053 -0.029053 -0.021125 -0.021125 0.267642 0.267642 0.248003 0.248003 0.000459 0.000458
polarizability: 2.19512114e+02 -1.83743187e-05 2.10300187e+02 -4.80705939e-02 -2.42607431e-03 8.34111535e+01
1716.lowfreq: -145.9248 -4.9888 -2.3227 -0.9951 -0.0005 -0.0002 0.0004 24.5096 26.3825
frequency: -145.9217 24.3622 26.3823 37.4011 50.3999 62.7866 70.8104 102.4482 115.9579 132.0997 168.1132 181.5488 214.1222 244.7865 245.4017 245.5719 292.5974 312.2664 331.2465 373.1875 402.8422 415.8622 419.0453 465.9285 551.0334 588.5081 601.7683 608.2412 693.1743 696.9097 698.5594 716.1066 725.4064 772.4216 779.9563 800.7352 800.7941 822.5750 863.8771 871.5100 889.7308 971.3642 975.8542 978.7913 991.6475 1037.4714 1042.2260 1059.2706 1103.3228 1111.2992 1112.2385 1139.6678 1139.6855 1148.6664 1166.5891 1182.0283 1213.0114 1250.5291 1250.5615 1306.8722 1307.6698 1355.8407 1357.2538 1375.4695 1399.4048 1399.9136 1444.4739 1463.0094 1463.0511 1475.2249 1475.8700 1479.0225 1483.5598 1490.1613 1495.3566 1540.2903 1615.3858 1615.7726 1670.3976 1679.2230 2996.1820 2996.2325 3009.8242 3009.8997 3068.3236 3068.3418 3093.4280 3093.5351 3107.3033 3107.3761 3139.5579 3160.7386 3186.9310 3190.6436 3561.1006 3571.3960
redmass: 2.6076 3.1944 2.5188 3.9276 4.0000 2.9203 3.2817 4.1609 3.0675 3.4587 3.7999 4.9049 4.6897 6.5779 1.2014 1.2022 6.1467 4.4008 5.9418 3.8674 4.1385 1.7033 5.9828 3.4499 4.0849 6.2374 6.5853 1.2667 10.9287 8.2726 6.3390 6.2686 5.1218 1.2278 4.4096 1.0946 1.0941 4.8612 3.9160 4.2370 1.3367 1.3380 4.7090 4.3074 1.2858 3.2735 3.3559 2.1893 2.6315 2.2265 2.1020 1.4622 1.4622 2.7853 3.9141 1.0619 1.7059 1.1302 1.1302 1.5342 2.6927 1.5512 1.3229 4.0697 1.2616 1.2742 2.6966 1.0403 1.0403 1.1199 1.2060 1.7508 1.3434 1.0861 1.3450 2.5750 6.0337 3.9236 8.2925 5.6869 1.0357 1.0357 1.0580 1.0581 1.1069 1.1069 1.0986 1.0985 1.1027 1.1028 1.0866 1.0945 1.0936 1.0966 1.0763 1.0729
irintensity: 0.0002 2.9855 0.0000 1.8211 0.0432 0.0000 9.2548 0.6059 0.0000 8.8430 0.0015 7.9517 2.8096 3.5286 0.0024 1.6798 13.0380 5.2373 12.9770 6.2566 5.0736 0.0000 0.2460 16.5598 0.0000 7.4010 0.0011 108.5453 0.0004 16.4430 85.9332 2.4264 0.0000 109.0043 0.4566 0.0029 8.4883 22.2444 0.2324 4.8584 0.0000 11.6372 64.5567 123.1459 0.0000 271.4652 200.0407 7.5741 94.2158 25.5700 4.1910 0.0156 9.9365 317.4982 527.3324 0.0720 20.9703 0.0000 0.0328 83.2566 96.3118 13.9513 17.8595 27.0000 6.4857 44.1626 287.4425 0.0002 24.7065 101.5834 3.7311 12.0807 180.8238 22.7842 352.0291 282.2198 34.5788 124.8155 413.0581 87.4672 1.4222 40.4601 50.3045 0.4503 0.5273 15.5084 62.5602 0.1342 0.0655 91.9502 6.0083 19.9409 5.3871 11.3793 11.7272 14.0666
temp: 298.150 k
press: 1.00000 atm
elementType: 8 8 8 8 7 7 6 6 6 6 6 6 6 6 6 6 6 6 1 1 1 1 1 1 1 1 1 1 1 1 1 1 1 1
symmnumber: 1
zpe: 709055.0 jmol-1
zpe.correction: 0.270065 hartree
zpe.thermalcorrener: 0.288389 hartree
zpe.thermalcorrenthalpy: 0.289333 hartree
zpe.thermalcorrgfe: 0.220702 hartree
zpe.sumelectzpe: -875.952750 hartree
zpe.sumelectthermal: -875.934426 hartree
zpe.sumelectthermalent: -875.933482 hartree
zpe.sumelectthermalfe: -876.002113 hartree
dipole: 0.0000 -4.4793 0.0004
dipole: 4.4793
quadrupole: -100.1684 -95.3242 -108.4479
quadrupole: 0.0000 0.0250 0.0003
quadrupole: 1.1451 5.9893 -7.1344 0.0000 0.0250 0.0003
hfenergy: -876.222815 hartree
pointgroup: C01 [X(C12H16N2O4)]
dipole: -0.0000062 1.7622998 0.0001665 debye
polarizability: 219.5121137|0.0000005|210.3001874|0.0480706|0.0024262|83.4111535 unknown
InChI: InChI=1S/C12H16N2O4/c1-3-17-11(15)13-9-7-5-6-8-10(9)14-12(16)18-4-2/h5-8,13-14H,3-4H2,1-2H3
charge 0 multiplicity 1
34 atoms
O  -3.012677 1.644713 0.000171
O  3.012673 1.644725 -0.000245
O  -3.717735 -0.604313 -0.003004
O  3.71774 -0.604298 0.00259
N  -1.424135 0.048357 -0.000115
N  1.424137 0.048363 0.000052
C  -0.717811 -1.191649 -0.000267
C  0.717818 -1.191646 0.000154
C  -1.41245 -2.4271 -0.000683
C  1.412462 -2.427094 0.000525
C  -0.705553 -3.646196 -0.00045
C  0.70557 -3.646193 0.000243
C  -2.799209 0.250039 -0.001362
C  2.79921 0.250051 0.001135
C  -4.44304 2.068055 -0.000528
C  4.443033 2.068073 0.000363
C  -4.448733 3.593306 0.001442
C  4.448721 3.593324 -0.001412
H  -2.503975 -2.414187 -0.001136
H  2.503987 -2.414177 0.000966
H  -0.912489 0.930459 0.001586
H  0.912487 0.930463 -0.001473
H  -1.26282 -4.588629 -0.000748
H  1.262841 -4.588623 0.000502
H  -4.933289 1.642611 0.893699
H  -4.931721 1.644928 -0.896712
H  4.933193 1.642746 -0.89397
H  4.931809 1.644833 0.896442
H  -3.941743 3.989157 0.89796
H  -5.490866 3.961118 0.001003
H  -3.94017 3.991477 -0.893155
H  3.940242 3.991378 0.893286
H  3.941643 3.989288 -0.89783
H  5.490852 3.96114 -0.001026
