program: Gaussian 09
title: 000232080
version: EM64L-G09RevD.01
frameworkgroup: C1[X(C18H15NO2S)]
method: RPBEPBE
basis: SDD
operation: Freq
keyword: #p
keyword: freq=noraman
keyword: PBEPBE/SDD
title: #p freq=noraman PBEPBE/SDD
converged: NO YES NO NO
title: Mulliken charges:
elementType: S O O N C C C C C C C C C C C C C C C C C C H H H H H H H H H H H H H H H
charge: 0.896089 -0.526737 -0.533099 -0.518796 0.123271 0.256804 0.270130 -0.038722 -0.294651 -0.376860 -0.236965 -0.240661 -0.412229 -0.400800 -0.240781 -0.244693 -0.225988 -0.226353 -0.203739 -0.210631 -0.237299 -0.217620 0.310553 0.258356 0.252960 0.235001 0.232854 0.301481 0.245983 0.284689 0.297125 0.237918 0.227534 0.242680 0.243226 0.231491 0.238482
chargesum: 0.00000
title: Mulliken charges with hydrogens summed into heavy atoms:
elementType: S O O N C C C C C C C C C C C C C C C C C C
charge: 0.896089 -0.526737 -0.533099 -0.208243 0.123271 0.256804 0.270130 -0.038722 -0.036295 -0.123900 -0.001964 -0.007807 -0.110748 -0.154818 0.043908 0.052431 0.011929 0.001180 0.038941 0.032595 -0.005808 0.020861
polarizability: 3.28872044e+02 -1.00114840e+01 2.57339244e+02 1.29374227e-01 8.28205523e+00 1.52411387e+02
1716.lowfreq: -5.0986 -2.8351 0.0008 0.0008 0.0019 6.7553 16.7583 30.8022 36.9888
frequency: 16.4330 30.7393 36.9507 53.4243 66.7505 76.0672 94.4471 123.0915 143.5533 158.8214 172.5798 187.0286 247.8077 262.6987 287.2512 308.3916 331.5293 364.5994 378.5962 402.4999 407.9893 414.3526 446.4212 495.8683 506.1073 522.4976 558.3298 577.5899 602.5410 610.4144 616.2009 657.9533 689.5778 709.7539 713.1407 745.0064 761.7917 773.0875 777.9735 796.6154 830.1591 851.6617 864.2102 879.0304 897.1567 927.8767 936.8467 940.7629 960.0932 978.5020 985.0267 985.4101 989.5470 990.7092 994.3355 1006.2186 1008.8583 1018.2248 1034.2354 1046.0117 1049.8559 1077.3741 1083.4558 1106.0622 1172.7326 1173.2677 1174.2818 1178.5864 1197.9527 1210.5294 1217.6117 1290.4334 1298.2361 1304.4408 1323.9305 1369.5376 1374.6781 1384.0747 1426.0500 1436.6650 1443.4489 1453.1912 1459.0920 1491.5337 1561.0266 1578.4478 1582.0859 1602.3952 1603.0871 1609.6703 3115.1810 3123.7156 3130.8983 3136.1081 3138.0913 3141.7044 3149.3177 3149.3662 3155.6421 3158.5188 3164.9990 3167.3033 3169.9401 3176.3028 3316.4104
redmass: 6.1882 3.9767 6.1917 4.8664 5.5187 5.5258 4.8639 4.7241 6.4134 6.6660 9.1060 6.1278 8.8159 5.4107 5.8227 5.1201 5.5877 5.2140 9.1661 2.8260 3.1070 6.2564 3.5432 4.1498 4.0517 4.0928 3.3389 5.5748 6.4756 6.7960 6.3616 6.8195 2.3722 3.6908 2.3609 2.0478 1.4360 1.7448 1.8444 13.3342 5.7024 1.2475 1.2582 1.3923 1.4602 7.4887 1.3654 1.3958 1.4070 6.0825 3.0149 1.5527 1.5630 1.3643 5.8785 1.3319 4.0727 1.3284 2.1005 1.9777 2.1575 1.5473 1.6619 1.7918 1.0703 1.0570 1.0548 1.1220 1.1299 1.8344 1.8789 1.8493 1.9013 1.3003 1.3757 3.6566 5.9040 8.6602 2.3610 2.2416 2.3547 2.0318 2.3002 2.6368 5.7606 5.8359 5.9128 6.8802 6.2154 5.9306 1.0916 1.0859 1.0855 1.0906 1.0859 1.0898 1.0934 1.0909 1.0946 1.0928 1.1013 1.0970 1.1005 1.1014 1.0737
irintensity: 1.5779 0.2507 1.3472 0.0951 0.3036 1.0081 0.6505 0.8174 3.0888 7.6114 2.4094 14.2550 9.3567 8.0952 2.5823 16.0302 0.6272 9.5431 10.2558 0.0784 5.3253 72.2414 50.1286 80.8196 4.6497 9.0982 1.1023 0.8800 0.0023 3.1536 0.0791 5.4811 31.5509 6.1944 37.9023 60.2726 67.8311 53.9849 16.3770 71.5096 1.9473 0.1167 11.1849 13.4190 114.0592 41.9042 1.0621 0.9815 1.9978 3.7341 0.0111 0.0133 1.5772 0.2767 9.6543 0.1440 1.0109 1.3313 1.4036 6.8546 26.2608 4.6442 6.5908 5.5310 1.8106 0.1941 0.1559 10.3816 2.3577 7.5569 0.8976 1.7133 4.7607 3.2653 1.2777 4.2065 3.3198 5.8608 6.1342 16.0996 2.4114 17.9105 40.5511 0.7617 4.0752 5.1818 1.4848 0.2850 4.8020 0.2845 6.5753 3.9841 1.2204 6.8220 1.1732 6.1445 13.9571 19.1093 21.8113 1.4999 38.9545 3.6664 20.7875 29.0377 35.4370
temp: 298.150 k
press: 1.00000 atm
elementType: 16 8 8 7 6 6 6 6 6 6 6 6 6 6 6 6 6 6 6 6 6 6 1 1 1 1 1 1 1 1 1 1 1 1 1 1 1
symmnumber: 1
zpe: 734977.1 jmol-1
zpe.correction: 0.279938 hartree
zpe.thermalcorrener: 0.299395 hartree
zpe.thermalcorrenthalpy: 0.300339 hartree
zpe.thermalcorrgfe: 0.229754 hartree
zpe.sumelectzpe: -1296.474752 hartree
zpe.sumelectthermal: -1296.455295 hartree
zpe.sumelectthermalent: -1296.454351 hartree
zpe.sumelectthermalfe: -1296.524936 hartree
dipole: -1.7094 4.2707 -1.2978
dipole: 4.7797
quadrupole: -99.7295 -134.3629 -139.4856
quadrupole: -6.9245 0.1065 3.9883
quadrupole: 24.7965 -9.8369 -14.9596 -6.9245 0.1065 3.9883
hfenergy: -1296.75469 hartree
pointgroup: C01 [X(C18H15N1O2S1)]
dipole: 0.7405625 1.5981322 0.6585788 debye
polarizability: 328.9682769|8.5527139|257.4762893|-7.4071723|3.0694465|152.1781094 unknown
InChI: InChI=1S/C18H15NO2S/c20-22(21,16-11-5-2-6-12-16)19-18-14-8-7-13-17(18)15-9-3-1-4-10-15/h1-14,19H
charge 0 multiplicity 1
37 atoms
S  1.084782 -1.401797 -0.473202
O  0.981618 -2.94274 0.046719
O  0.595787 -0.982349 -1.980521
N  0.141571 -0.355002 0.965743
C  -0.324249 0.93424 0.580955
C  -1.702109 1.211432 0.273766
C  -2.734143 0.133088 0.183818
C  2.85786 -0.801415 -0.288047
C  0.622225 1.998145 0.620596
C  -2.082266 2.563844 0.076267
C  0.226615 3.3243 0.373128
C  -1.135846 3.610333 0.110897
C  -2.560261 -0.975628 -0.691763
C  -3.93153 0.223611 0.945133
C  3.617356 -1.305916 0.780628
C  3.351503 0.092522 -1.251913
C  -3.555671 -1.972947 -0.786852
C  -4.924432 -0.775772 0.847158
C  4.958587 -0.872218 0.889314
C  4.69632 0.512273 -1.125251
C  -4.738102 -1.88023 -0.016636
C  5.492756 0.03428 -0.058102
H  -0.642482 -1.01908 1.142759
H  1.657155 1.759469 0.886999
H  -3.131303 2.785516 -0.149194
H  0.965173 4.132211 0.407037
H  -1.457152 4.641664 -0.070663
H  -1.669917 -1.032307 -1.330753
H  -4.07055 1.068905 1.629377
H  3.182349 -2.018796 1.487848
H  2.709215 0.426944 -2.073111
H  -3.407083 -2.816942 -1.469063
H  -5.837688 -0.695721 1.447429
H  5.582619 -1.244692 1.708191
H  5.117535 1.205766 -1.860414
H  -5.50706 -2.65724 -0.090804
H  6.533921 0.36245 0.031927
