program: Gaussian 09
title: 000232085
version: EM64L-G09RevD.01
frameworkgroup: C1[X(C21H20O)]
method: RPBEPBE
basis: SDD
operation: Freq
keyword: #pfreq=noraman
keyword: PBEPBE/SDD
title: #p freq=noraman PBEPBE/SDD
converged: YES YES NO NO
title: Mulliken charges:
elementType: O C C C C C C C C C C C C C C C C C C C C C H H H H H H H H H H H H H H H H H H H H
charge: -0.457881 -0.066642 0.262127 0.254072 0.246125 0.325887 0.311135 -0.372769 -0.362393 -0.372268 -0.383379 -0.410298 -0.416548 -0.898747 -0.819902 -0.266087 -0.274583 -0.246416 -0.242413 -0.242095 -0.237239 -0.242518 0.268017 0.256899 0.263639 0.282122 0.356073 0.228364 0.229264 0.237003 0.245277 0.242278 0.261418 0.204799 0.247093 0.229751 0.226391 0.226816 0.223968 0.227767 0.227353 0.228539
chargesum: 0.00000
title: Mulliken charges with hydrogens summed into heavy atoms:
elementType: O C C C C C C C C C C C C C C C C C C C C C
charge: -0.101808 -0.066642 0.262127 0.254072 0.246125 0.325887 0.311135 -0.104752 -0.105495 -0.108629 -0.101257 -0.181934 -0.187284 -0.174189 -0.106592 -0.036336 -0.048191 -0.019600 -0.018445 -0.014328 -0.009886 -0.013979
polarizability: 2.39533383e+02 2.71837929e+00 2.38016418e+02 -4.29936309e+00 -6.05889347e-01 1.82328881e+02
1716.lowfreq: -20.4927 -0.0009 -0.0004 0.0006 6.5776 7.2089 37.7233 41.7599 61.0403
frequency: 37.6060 41.5596 60.9987 63.9858 67.6634 91.1772 117.4185 164.6343 170.5441 200.9859 219.4069 233.3199 249.1407 260.8871 271.0698 289.9787 307.3882 325.9123 347.5464 404.5303 409.1176 412.5265 434.9252 456.7620 469.3901 520.6351 532.3241 542.3697 547.0836 583.0224 615.1140 632.2126 635.4675 673.8727 710.8107 731.4601 735.3322 749.1478 760.5390 766.4008 790.9555 796.6298 864.0715 871.8217 876.0453 884.3581 904.2792 935.5037 943.7646 954.2211 963.1405 986.5635 988.0501 988.5597 990.2141 992.0189 995.3760 1001.0440 1027.8710 1043.6625 1048.9379 1055.9173 1058.0264 1084.1819 1094.9727 1111.5511 1157.1854 1161.3278 1171.8508 1176.1665 1176.4461 1187.8304 1192.9210 1215.2697 1220.2776 1270.4641 1292.3766 1298.2773 1315.4179 1360.1258 1365.0606 1377.7614 1392.5878 1399.9514 1427.6805 1428.7203 1433.1052 1455.8964 1472.7666 1475.1519 1477.2857 1482.4555 1485.6368 1498.7267 1579.8768 1581.7601 1588.2501 1606.9008 1609.4025 1611.7487 2965.2154 2992.7664 3045.5987 3072.1038 3085.1729 3089.6873 3115.7880 3116.3636 3123.4927 3131.1585 3131.4660 3132.6243 3145.9230 3147.8498 3148.4115 3153.7567 3163.0330 3164.0030 3165.2851 3564.8550
redmass: 3.5132 4.0313 4.1265 4.5909 4.4909 4.0642 1.1223 3.0711 3.0049 1.4572 3.7654 4.7167 2.3908 3.8378 3.7503 4.7173 1.9492 2.2419 2.8712 2.9964 2.9992 2.9175 3.5336 2.8941 3.0741 4.2704 4.0591 4.8644 4.3626 4.5788 6.3700 6.1403 5.5982 5.9304 1.8840 2.7251 2.6922 1.8680 1.5717 1.5142 3.1866 3.8543 1.2576 1.4048 1.4536 2.4504 3.8093 2.3867 1.6657 1.4990 1.9077 1.4390 1.8373 1.6055 2.0660 1.4366 1.6020 1.3178 2.2380 1.5635 1.6114 2.2018 2.2589 1.6855 2.7990 2.0346 1.6681 2.2979 1.0526 1.0877 1.0931 1.5247 1.7277 2.5116 2.4152 1.5662 1.4297 1.5972 1.3439 8.2888 7.7934 8.1770 1.2342 1.2260 2.0357 2.0190 2.2143 1.1149 2.1089 1.3483 1.9365 1.9556 1.1333 1.0941 6.1520 6.2794 6.1570 6.0301 6.0605 6.0938 1.0379 1.0366 1.0981 1.0969 1.0985 1.0977 1.0863 1.0866 1.0846 1.0889 1.0885 1.0881 1.0923 1.0934 1.0936 1.0956 1.1000 1.0993 1.1009 1.0652
irintensity: 1.7428 0.4119 0.2393 0.3239 0.0855 0.8175 0.7191 1.5210 6.8319 86.7537 0.4254 3.7296 6.9227 0.3705 5.2593 0.9846 40.2514 8.9308 38.9545 0.0331 2.8675 5.9733 2.8088 4.9381 2.7047 1.7591 4.8245 2.9751 0.8525 2.4485 0.0700 14.7725 17.6790 0.4137 37.0935 6.8033 12.2070 48.7973 58.4907 78.2901 12.7196 7.5389 0.4372 2.2920 2.1603 20.2548 13.2693 21.1221 7.7356 1.9701 8.7819 0.0443 0.2561 1.6502 0.4853 0.5578 1.4696 0.1445 8.9320 10.2614 16.9017 2.8028 7.6400 1.3198 10.4084 6.5385 12.3211 1.3980 0.0303 2.1675 1.4696 15.0331 1.7473 8.4905 2.3288 47.5012 7.6066 18.2692 1.1683 0.6533 3.3895 0.4041 16.5818 22.1839 7.2806 7.9779 13.6600 11.3827 17.4184 24.4359 8.3378 16.8323 6.4401 17.3875 0.6952 1.5352 0.9726 3.4639 7.0361 4.8104 25.9687 32.4959 11.9872 26.6589 24.4232 10.2437 8.5266 9.6547 0.3360 13.5679 10.6836 7.4559 22.6870 37.1456 11.9812 20.1633 29.4501 22.2292 23.9952 5.7881
temp: 298.150 k
press: 1.00000 atm
elementType: 8 6 6 6 6 6 6 6 6 6 6 6 6 6 6 6 6 6 6 6 6 6 1 1 1 1 1 1 1 1 1 1 1 1 1 1 1 1 1 1 1 1
symmnumber: 1
zpe: 901369.6 jmol-1
zpe.correction: 0.343314 hartree
zpe.thermalcorrener: 0.362816 hartree
zpe.thermalcorrenthalpy: 0.363760 hartree
zpe.thermalcorrgfe: 0.295749 hartree
zpe.sumelectzpe: -885.906096 hartree
zpe.sumelectthermal: -885.886594 hartree
zpe.sumelectthermalent: -885.885650 hartree
zpe.sumelectthermalfe: -885.953661 hartree
dipole: -1.9233 0.0960 -0.4574
dipole: 1.9793
quadrupole: -120.1881 -121.2639 -125.9877
quadrupole: 0.9573 -3.4343 -0.0314
quadrupole: 2.2918 1.2160 -3.5078 0.9573 -3.4343 -0.0314
hfenergy: -886.2494096 hartree
pointgroup: C01 [X(C21H20O1)]
dipole: -0.7276074 -0.1896926 0.2024692 debye
polarizability: 240.7426505|-2.348275|236.812904|1.4374134|3.8794929|182.3231283 unknown
InChI: InChI=1S/C21H20O/c1-16-10-6-8-14-19(16)21(22,18-12-4-3-5-13-18)20-15-9-7-11-17(20)2/h3-15,22H,1-2H3
charge 0 multiplicity 1
42 atoms
O  -0.05904 0.194283 -2.070929
C  -0.0572 0.132437 -0.57577
C  -0.200899 -1.340211 -0.091063
C  1.312732 0.744425 -0.182865
C  -1.237674 0.997388 -0.065272
C  -1.211542 -2.217978 -0.604246
C  2.529725 0.31695 -0.809737
C  0.653982 -1.819233 0.934343
C  1.373349 1.723893 0.83933
C  -1.991795 0.653417 1.083675
C  -1.560903 2.193611 -0.760286
C  -1.293745 -3.537348 -0.089238
C  3.746121 0.914973 -0.388487
C  -2.214434 -1.824313 -1.681294
C  2.598583 -0.736422 -1.903426
C  0.556559 -3.134736 1.43703
C  2.595413 2.302486 1.246411
C  -0.422224 -4.006434 0.91736
C  3.793832 1.898451 0.623483
C  -3.056316 1.476283 1.519362
C  -2.624119 3.014583 -0.327043
C  -3.379647 2.657619 0.814697
H  1.415663 -1.14913 1.344457
H  0.448938 2.04431 1.328691
H  -1.751302 -0.259954 1.63778
H  -0.963048 2.476891 -1.633006
H  -0.992611 0.079616 -2.380876
H  -2.06584 -4.207447 -0.487408
H  4.677679 0.592427 -0.869568
H  -3.051902 -2.542715 -1.708552
H  -2.654139 -0.825289 -1.501223
H  -1.750943 -1.833446 -2.687197
H  2.194331 -0.34075 -2.849967
H  3.643747 -1.055012 -2.064133
H  1.994138 -1.626331 -1.659386
H  1.239077 -3.469145 2.22607
H  2.604901 3.05824 2.039541
H  -0.513996 -5.032207 1.291496
H  4.753376 2.336566 0.9210
H  -3.631289 1.192629 2.408194
H  -2.859481 3.934065 -0.875075
H  -4.206058 3.293458 1.151726
