program: Gaussian 09
title: 000232026
version: EM64L-G09RevD.01
frameworkgroup: C1[X(C9H9BrS)]
method: RPBEPBE
basis: SDD
operation: Freq
keyword: #p
keyword: freq=noraman
keyword: PBEPBE/SDD
title: #p freq=noraman PBEPBE/SDD
converged: NO YES NO NO
title: Mulliken charges:
elementType: Br S C C C C C C C C C H H H H H H H H H
charge: 0.012858 0.193234 -0.194281 -0.199731 -0.244764 -0.730298 -0.179034 -0.167605 -0.203352 0.008775 -0.544946 0.252582 0.262129 0.274041 0.272564 0.253675 0.254642 0.234247 0.223847 0.221416
chargesum: 0.00000
title: Mulliken charges with hydrogens summed into heavy atoms:
elementType: Br S C C C C C C C C C
charge: 0.012858 0.193234 -0.194281 0.052851 0.017365 -0.183693 0.074641 0.087037 -0.203352 0.243022 -0.099682
polarizability: 2.38241559e+02 -8.96024371e-01 1.00619013e+02 -2.36365644e+00 9.76397866e+00 7.10001113e+01
1716.lowfreq: -3.3130 0.0014 0.0018 0.0022 0.5214 9.0693 15.2812 38.9438 53.5313
frequency: 14.8518 38.8324 53.4849 93.1789 129.2290 178.8528 224.1854 271.6259 304.5836 315.8578 400.0707 407.5137 461.7198 496.6110 547.2090 618.4998 699.1176 700.8674 717.8373 823.1738 830.0725 876.6594 940.2089 951.3634 953.0768 967.0515 986.4438 1001.8909 1053.6659 1069.2505 1076.8120 1100.2963 1181.0334 1195.8436 1228.9211 1281.6140 1291.5554 1351.3661 1374.2508 1418.4505 1449.6349 1455.2759 1568.2573 1569.9311 1651.0394 3026.9669 3092.8406 3102.3718 3120.4969 3141.3486 3152.7902 3170.1592 3175.6194 3205.3881
redmass: 4.0993 5.0280 2.5187 4.5545 5.0399 8.6444 4.9470 4.2811 5.8366 4.8698 2.2135 2.8338 6.9991 3.2787 2.2679 7.0932 3.8791 5.7125 2.4673 1.3618 1.3194 1.3712 2.0292 1.3371 1.3280 1.3771 6.1441 1.1292 4.5937 1.7813 1.5189 1.3883 1.1155 1.5623 1.1865 1.2371 1.2220 4.4767 4.0335 1.1506 1.9739 1.1944 6.3211 7.7920 4.5436 1.0572 1.0622 1.0996 1.1002 1.0894 1.0890 1.0959 1.0973 1.1148
irintensity: 0.1008 0.5993 1.1124 0.2566 0.1379 0.3792 3.4827 0.5860 1.2081 0.5346 0.6810 0.0522 11.4247 38.4264 9.5871 0.0919 3.8083 7.8709 15.7458 36.7015 26.4700 23.9940 3.5517 0.4634 79.6278 0.5296 99.1820 15.0111 15.7662 23.1506 6.2591 6.7412 0.4134 1.7939 18.2605 0.3602 0.6869 1.6742 8.6269 9.9648 83.3975 18.4023 6.7605 0.3192 7.6617 15.0751 5.3697 9.4008 13.7431 4.3857 1.6781 6.6333 1.9138 25.4630
temp: 298.150 k
press: 1.00000 atm
elementType: 35 16 6 6 6 6 6 6 6 6 6 1 1 1 1 1 1 1 1 1
symmnumber: 1
zpe: 391832.3 jmol-1
zpe.correction: 0.149241 hartree
zpe.thermalcorrener: 0.160937 hartree
zpe.thermalcorrenthalpy: 0.161881 hartree
zpe.thermalcorrgfe: 0.107819 hartree
zpe.sumelectzpe: -759.046501 hartree
zpe.sumelectthermal: -759.034806 hartree
zpe.sumelectthermalent: -759.033862 hartree
zpe.sumelectthermalfe: -759.087924 hartree
dipole: -1.5431 -0.8862 0.9137
dipole: 2.0003
quadrupole: -80.7054 -77.3494 -84.0436
quadrupole: 4.6850 -3.1015 5.1295
quadrupole: -0.0059 3.3501 -3.3441 4.6850 -3.1015 5.1295
hfenergy: -759.1957426 hartree
pointgroup: C01 [X(C9H9Br1S1)]
dipole: 0.6392169 0.2897784 0.3560728 debye
dipolederiv: -0.7789141 0.1498324 0.0767232 0.1806673 -0.1032724 -0.0098437 0.1089258 -0.0151604 -0.0515183 -0.4331432 -0.048425 -0.0524033 -0.2275406 -0.0598437 0.077802 -0.0330402 0.0641238 -0.0650275 0.6909434 -0.1032035 -0.03112 -0.2023724 -0.0777683 -0.0862655 -0.0825681 -0.0590817 -0.1142153 -0.1638323 0.0880116 -0.052978 0.0203553 -0.0067396 -0.0357195 0.0909884 -0.0674056 -0.0906254 -0.246696 -0.0663102 0.0000547 0.1085108 0.0344099 -0.0408682 -0.0708019 -0.0196786 -0.0955519 0.2766003 0.103873 0.1708021 0.3656299 0.1330842 0.0774171 0.1831398 0.0512738 0.2019728 -0.4013991 -0.0258837 0.0543662 0.0837987 0.0227886 -0.0532529 0.0437722 -0.0323798 -0.0876862 -0.3441242 0.1961769 -0.0195487 0.0836576 -0.0364504 -0.0310345 0.0215524 -0.0517537 -0.0690298 1.2948884 -0.3001003 -0.1817689 -0.3138728 0.0969338 -0.0031889 -0.2152743 0.0011092 -0.0874049 0.1766618 0.0227371 0.0172589 -0.000229 -0.107205 -0.1689438 -0.2229777 -0.2036987 -0.0359847 -0.1904639 0.0096403 -0.0955898 -0.0164282 -0.220948 -0.2302291 -0.0329389 -0.2084787 -0.0632178 0.001989 -0.0715403 0.0638743 -0.0652952 0.033061 0.0407693 0.0572837 0.0438032 0.1207045 0.068863 0.0701778 0.0047417 0.0527847 -0.011755 0.0471075 0.0003077 0.0387588 0.1330254 -0.0422759 0.0627225 -0.0130474 0.0448798 -0.0509529 -0.059591 0.0151297 -0.0109176 0.0585807 -0.014875 -0.0249194 -0.0641612 -0.0928102 0.0354531 0.0422981 -0.0707314 0.0323574 -0.1116267 0.0566281 0.0555367 -0.0004805 0.0598317 -0.0212566 0.0481836 -0.0055297 0.0443514 0.1491287 0.0073769 -0.065228 0.0439066 -0.0600229 0.0386684 0.0495201 0.0542978 0.0486574 0.1385438 0.0499457 0.0107779 -0.0121861 -0.0081194 0.069323 0.1190389 0.0639525 0.1332162 -0.0160529 -0.1038672 -0.044439 0.0559789 -0.0031532 0.1485974 0.0826416 0.0959141 0.0731054 0.099088 0.0956943 -0.0194367 0.0355773 -0.0102719 0.0838726 0.1341589 -0.0014018 0.1377982 -0.0131024 unknown
polarizability: 237.1482939|-12.4264069|102.1020196|-1.1378019|-9.1189802|70.6103699 unknown
InChI: InChI=1S/C9H9BrS/c1-2-7-11-9-5-3-8(10)4-6-9/h2-6H,1,7H2
charge 0 multiplicity 1
20 atoms
Br -4.688028 0.701474 0.290816
S  1.657682 -0.933978 -0.65996
C  -0.095727 -0.44643 -0.359867
C  -0.551998 0.859345 -0.661601
C  -1.007649 -1.413067 0.125386
C  2.563851 0.219381 0.601303
C  -1.906853 1.208532 -0.462006
C  -2.370492 -1.08185 0.311836
C  -2.800038 0.228901 0.021355
C  3.924435 0.562106 0.068598
C  5.08855 0.1457 0.630454
H  0.141117 1.602186 -1.071255
H  -0.655521 -2.421705 0.362918
H  1.918877 1.109385 0.694545
H  2.609668 -0.31107 1.565137
H  -2.258093 2.217802 -0.694764
H  -3.074371 -1.831009 0.685003
H  3.946382 1.181842 -0.838719
H  6.059623 0.42698 0.209045
H  5.100085 -0.487325 1.526177
