program: Gaussian 09
title: 000232084
version: EM64L-G09RevD.01
frameworkgroup: C1[X(C21H18N2O3)]
method: RPBEPBE
basis: SDD
operation: Freq
keyword: #p
keyword: freq=noraman
keyword: PBEPBE/SDD
title: #p freq=noraman PBEPBE/SDD
converged: YES YES NO NO
title: Mulliken charges:
elementType: O O O N N C C C C C C C C C C C C C C C C C C C C C H H H H H H H H H H H H H H H H H H
charge: -0.259617 -0.253991 -0.242076 -0.490780 -0.533973 0.322192 0.270715 -0.470709 -0.300004 0.352352 -0.385468 0.137431 0.122101 0.246759 0.261712 -0.345279 -0.355143 -0.347768 -0.353329 -0.224079 -0.240078 -0.224689 -0.239376 -0.226369 -0.226506 -0.536732 0.324437 0.266236 0.320787 0.307665 0.244779 0.275759 0.220913 0.276845 0.213662 0.234031 0.232617 0.234693 0.232480 0.234224 0.234955 0.220174 0.221932 0.246517
chargesum: 0.00000
title: Mulliken charges with hydrogens summed into heavy atoms:
elementType: O O O N N C C C C C C C C C C C C C C C C C C C C C
charge: -0.259617 -0.253991 -0.242076 -0.169994 -0.226307 0.322192 0.270715 -0.146271 -0.033768 0.352352 -0.140689 0.137431 0.122101 0.246759 0.261712 -0.069520 -0.134230 -0.070923 -0.139668 0.009952 -0.007461 0.010004 -0.006896 0.007855 0.008449 0.151890
polarizability: 3.64741102e+02 3.10145359e+01 2.97840960e+02 -1.77978192e+01 2.71172368e+01 1.60307952e+02
1716.lowfreq: -3.5682 -0.0009 -0.0007 -0.0005 3.4768 3.8104 16.0489 21.6804 27.1706
frequency: 15.9103 21.6413 27.1158 37.1397 41.6674 48.3592 78.8514 87.3330 94.7239 127.6553 134.9753 154.9309 178.9394 201.3593 224.0702 240.3584 244.7785 275.3495 290.3807 311.8970 358.7898 395.0670 401.5039 402.4792 412.0338 414.9587 455.5959 465.1224 477.5431 495.7916 550.4662 558.1813 592.4808 612.8391 614.4921 615.3106 654.8218 670.4778 683.3949 686.7876 702.1253 702.5514 712.1679 723.4941 739.1406 786.8527 791.9737 794.6288 804.1154 852.5984 855.0845 869.3052 876.9487 900.0698 916.7959 932.3800 934.6907 936.8924 984.6432 985.2490 989.0708 989.3667 1006.5960 1007.0356 1011.4188 1023.1313 1024.5275 1064.8359 1076.2927 1087.2676 1093.5966 1112.3367 1132.3732 1149.9939 1174.1217 1174.2021 1187.9557 1191.9557 1193.4007 1208.8152 1239.4101 1249.5642 1279.5675 1296.2935 1318.6879 1321.1537 1375.6711 1384.2610 1384.5996 1429.1705 1432.0565 1433.6886 1444.4206 1457.0798 1462.0323 1467.1966 1473.5383 1482.7965 1484.7718 1516.5168 1575.6058 1576.8950 1589.6733 1608.9626 1609.0372 1610.5377 1612.1576 1631.6681 2959.8689 3047.7769 3112.4566 3115.7792 3126.2699 3132.8317 3132.8572 3145.7296 3146.0730 3158.9877 3159.1504 3164.0240 3170.2768 3170.5044 3185.7795 3206.4062 3505.7884 3508.7251
redmass: 4.9759 5.6585 4.5314 4.9405 4.8603 5.3450 4.9990 5.4162 3.9894 5.3527 4.5667 5.0847 5.3342 4.0709 1.9414 3.6887 2.4880 4.8576 5.6698 8.4311 6.0618 4.5944 2.8329 2.9367 4.8622 5.1370 3.0768 4.6753 4.7415 4.5369 3.0110 1.6283 4.4160 5.2085 6.1427 5.0985 5.9989 5.9546 4.6280 5.1930 1.5316 1.5291 2.1339 6.0646 1.5950 2.6877 2.3834 1.6161 3.6528 1.2915 1.2819 5.6331 4.3439 1.6000 4.4715 1.3877 1.4546 1.5333 1.4524 1.5281 5.0192 4.2193 1.3482 1.3457 3.4012 2.6692 2.4497 3.1378 2.0198 1.6447 2.0233 1.2594 1.7078 1.5486 1.0589 1.0601 1.9825 1.1222 1.1397 1.6469 2.9409 3.0534 1.5551 2.9630 1.3407 1.4226 6.0493 8.9148 8.9952 2.0572 2.1052 1.8955 1.8875 2.1253 2.1848 1.0504 1.1591 2.3100 2.3264 2.6295 6.6374 6.1917 5.3270 5.7451 6.0397 6.0069 6.5376 7.3228 1.0330 1.1040 1.0881 1.0880 1.0993 1.0868 1.0866 1.0917 1.0918 1.0955 1.0956 1.0881 1.1008 1.1007 1.0964 1.0927 1.0756 1.0754
irintensity: 4.6722 0.5171 0.3047 2.0265 3.5438 1.8542 4.0454 4.2926 2.3449 4.9427 2.8365 0.6024 0.4709 3.7900 0.1929 1.8039 1.5199 9.4591 4.8545 4.6134 2.5919 1.8523 0.2622 0.2467 2.6178 0.3884 13.4138 3.2626 8.8994 1.1123 57.1506 123.0392 3.0221 3.4680 1.1558 2.4753 8.3143 17.5085 5.1194 10.8251 41.4644 122.8127 33.2596 10.7233 29.5895 7.8929 28.5961 33.6001 9.8055 0.9152 0.8271 12.2102 8.7751 32.4591 4.0664 1.5577 4.5624 4.3154 1.3819 2.4519 0.7436 0.9643 3.6174 2.3927 62.7540 12.2537 26.0411 36.4662 16.0066 28.2070 2.0359 0.1954 32.4371 26.1532 1.5498 2.1334 122.5672 10.6522 25.0715 9.0605 192.4810 188.3761 100.2873 1.7607 1.7486 0.4652 6.8942 0.6499 0.8006 281.4861 0.5935 41.5840 270.0216 53.8412 160.8309 13.6494 67.2425 92.8809 8.1116 451.3734 62.5474 61.4413 60.4997 24.5121 15.3763 8.6013 72.3936 129.4917 82.2869 47.8383 17.8325 14.0973 25.7652 1.1400 0.8866 19.9428 19.8885 13.6529 13.8243 10.1182 19.9751 25.1057 3.7300 8.0355 13.9929 31.1442
temp: 298.150 k
press: 1.00000 atm
elementType: 8 8 8 7 7 6 6 6 6 6 6 6 6 6 6 6 6 6 6 6 6 6 6 6 6 6 1 1 1 1 1 1 1 1 1 1 1 1 1 1 1 1 1 1
symmnumber: 1
zpe: 896911.4 jmol-1
zpe.correction: 0.341616 hartree
zpe.thermalcorrener: 0.364401 hartree
zpe.thermalcorrenthalpy: 0.365345 hartree
zpe.thermalcorrgfe: 0.285905 hartree
zpe.sumelectzpe: -1144.414354 hartree
zpe.sumelectthermal: -1144.391568 hartree
zpe.sumelectthermalent: -1144.390624 hartree
zpe.sumelectthermalfe: -1144.470065 hartree
dipole: 4.0288 0.1886 1.5655
dipole: 4.3264
quadrupole: -130.5484 -139.0775 -151.1038
quadrupole: 23.1862 2.7673 -5.1800
quadrupole: 9.6948 1.1657 -10.8605 23.1862 2.7673 -5.1800
hfenergy: -1144.7559692 hartree
pointgroup: C01 [X(C21H18N2O3)]
dipole: -1.2686458 -0.9619619 0.6019816 debye
polarizability: 315.1923034|41.9369347|348.0699065|30.1397529|-8.8842299|159.6278044 unknown
InChI: InChI=1S/C21H18N2O3/c1-26-17-12-13-18(22-20(24)15-8-4-2-5-9-15)19(14-17)23-21(25)16-10-6-3-7-11-16/h2-14,22-23H,1H3
charge 0 multiplicity 1
44 atoms
O  3.316055 4.262692 0.059801
O  3.616037 -0.503614 0.572801
O  -2.605108 1.821191 -1.341556
N  1.364203 -0.186193 -0.009658
N  -1.192312 0.855567 0.256813
C  1.241618 1.227112 0.083231
C  -0.086189 1.763641 0.137552
C  2.352704 2.096617 0.082954
C  -0.271105 3.159036 0.103709
C  2.142479 3.495215 0.071859
C  0.831756 4.036074 0.06101
C  2.509027 -0.970376 0.164902
C  -2.413008 0.969427 -0.422917
C  2.329593 -2.437619 -0.138583
C  -3.480015 -0.014901 -0.01048
C  3.251387 -3.337842 0.455253
C  1.322363 -2.947374 -1.001664
C  -4.524132 -0.2594 -0.939756
C  -3.507498 -0.672148 1.248969
C  3.152963 -4.723492 0.215977
C  1.227674 -4.335421 -1.244349
C  -5.561194 -1.162195 -0.629883
C  -4.549754 -1.573138 1.560582
C  2.136997 -5.227653 -0.630727
C  -5.575013 -1.825859 0.620223
C  3.171501 5.719606 0.028996
H  3.368192 1.699564 0.087122
H  -1.288128 3.55807 0.10437
H  0.507376 -0.672183 -0.287128
H  -1.123878 0.135255 0.98078
H  0.657503 5.114729 0.033178
H  4.039203 -2.923034 1.092405
H  0.635353 -2.275287 -1.531286
H  -4.501172 0.279386 -1.892601
H  -2.752268 -0.460657 2.016879
H  3.866816 -5.409655 0.684411
H  0.454954 -4.717606 -1.920132
H  -6.359082 -1.346909 -1.357251
H  -4.567839 -2.067106 2.53808
H  2.061783 -6.30405 -0.820396
H  -6.382659 -2.524714 0.864156
H  2.63982 6.091156 0.926663
H  2.63856 6.052569 -0.882908
H  4.200039 6.108818 0.019901
