program: Gaussian 09
title: 000232090
version: EM64L-G09RevD.01
frameworkgroup: C1[X(C23H22O)]
method: RPBEPBE
basis: SDD
operation: Freq
keyword: #pfreq=noraman
keyword: PBEPBE/SDD
title: #p freq=noraman PBEPBE/SDD
converged: YES YES NO NO
title: Mulliken charges:
elementType: O C C C C C C C C C C C C C C C C C C C C C C C H H H H H H H H H H H H H H H H H H H H H H
charge: -0.192579 -0.078761 0.314551 0.258240 0.326259 0.131830 0.262610 0.249744 -0.370052 -0.353817 -0.378801 -0.368446 -0.783640 -0.391510 -0.402359 -0.857194 -0.856143 -0.281888 -0.273734 -0.250528 -0.251942 -0.262117 -0.266950 -0.253455 0.259374 0.260570 0.264460 0.257054 0.255032 0.257582 0.242641 0.228504 0.231896 0.264655 0.241594 0.225014 0.258251 0.222617 0.262966 0.227299 0.229064 0.225787 0.228021 0.228111 0.229975 0.230214
chargesum: 0.00000
title: Mulliken charges with hydrogens summed into heavy atoms:
elementType: O C C C C C C C C C C C C C C C C C C C C C C C
charge: -0.192579 -0.078761 0.314551 0.258240 0.326259 0.131830 0.262610 0.249744 -0.110678 -0.093247 -0.114341 -0.111391 -0.028385 -0.163006 -0.170463 -0.125932 -0.112310 -0.054589 -0.044670 -0.024740 -0.023921 -0.034006 -0.036975 -0.023241
polarizability: 2.66987051e+02 -7.24336240e+00 2.46439791e+02 6.33257139e+00 -2.26944701e+00 2.04885242e+02
1716.lowfreq: -10.3890 -6.8678 0.0006 0.0006 0.0008 5.0519 42.3276 59.6969 62.1310
frequency: 42.3018 59.6911 62.1003 68.0013 81.1194 87.6577 112.9892 136.9776 172.1123 180.9340 198.3123 206.7809 220.0920 224.6785 233.4762 254.4995 270.2309 278.1403 296.1897 304.8124 317.7924 346.3227 403.6409 417.5142 421.0728 457.6522 460.9874 493.7487 503.1119 536.9074 540.5021 544.2859 556.0753 585.3503 617.8315 634.4610 637.2615 664.7287 715.8057 725.0921 730.4129 751.7793 756.6884 760.4158 779.4822 793.8224 865.9645 869.7669 871.6544 875.9423 882.2462 906.6763 943.3127 953.0721 961.1252 980.4072 984.8470 989.6692 991.3315 991.7524 994.3425 995.3413 1002.1396 1018.6804 1032.3026 1043.1343 1045.5646 1060.0667 1063.3678 1086.2817 1091.0548 1115.9140 1143.8065 1161.1452 1166.3729 1173.6386 1176.5699 1180.2037 1184.2877 1200.3298 1215.9617 1221.5744 1291.3706 1301.4919 1321.9276 1352.4426 1359.8038 1368.2464 1371.8354 1394.8811 1401.9195 1427.2255 1429.4495 1432.7688 1441.0616 1453.6626 1465.3869 1469.1626 1481.1725 1481.7164 1482.5295 1485.5050 1486.7184 1578.3222 1580.4179 1584.7822 1603.1650 1606.8752 1610.0363 1615.6644 2982.6086 2987.3709 2994.9692 3064.8765 3066.6943 3083.4989 3086.9395 3097.6479 3113.8118 3117.2379 3119.7637 3121.7929 3129.2680 3130.5382 3133.7247 3142.5661 3150.9421 3153.0727 3154.6560 3164.6185 3166.8578 3172.6135
redmass: 4.2422 4.5246 3.6351 3.8472 4.2555 4.5014 4.0262 4.0969 3.5673 3.1779 3.3687 1.2962 1.3325 1.7041 1.3931 3.1724 4.1002 4.0890 4.0710 4.3488 4.2454 3.7276 2.9917 2.9699 2.9497 3.0783 2.9446 3.7379 3.8953 3.9163 4.4968 4.3670 3.3434 3.6633 6.3049 5.6736 5.9288 5.7832 1.9603 3.2622 3.4931 1.7006 1.7050 1.2948 2.7604 3.9644 1.2929 2.0033 1.7601 2.3707 1.9465 2.8326 1.5421 1.4002 1.5327 1.9692 1.6306 1.4540 2.3586 1.7842 1.4959 1.4358 1.3538 2.0191 2.2462 1.5545 1.5705 2.2216 2.4217 1.8417 3.1444 2.3756 2.3395 2.3336 2.1390 1.0663 1.1969 1.2038 2.5120 1.1213 2.5494 2.1941 1.4397 1.4395 1.4061 7.6446 8.2448 1.2293 6.2421 1.2048 1.2145 1.9469 2.0174 2.1001 1.1394 1.0614 1.3602 1.2634 1.3810 1.9586 1.6331 1.1012 1.3674 5.9654 5.9923 5.9269 6.6498 5.7833 6.3284 6.9991 1.0372 1.0381 1.0366 1.0978 1.0976 1.0949 1.0972 1.0975 1.0868 1.0868 1.1002 1.0861 1.0878 1.0889 1.0893 1.0929 1.0949 1.0944 1.0962 1.1005 1.0972 1.0958
irintensity: 0.5651 0.4547 2.4577 0.5603 0.0598 0.5043 0.7147 0.5337 0.2724 0.5661 2.5395 0.8504 0.9150 0.6897 0.0541 0.4984 1.8891 0.0614 3.5097 2.1153 1.0984 5.4891 1.3849 0.3448 0.3442 8.4661 2.3356 3.2297 4.3527 1.9805 3.9389 1.9277 1.4374 27.0698 0.0700 8.0925 8.3921 0.6833 42.0892 2.7550 5.6049 58.0356 24.3665 67.7366 8.1277 5.9631 0.2734 1.6904 0.7292 4.4285 1.5853 2.4564 0.3005 0.2811 0.4151 6.2387 0.9902 0.8813 0.4744 0.1981 1.1626 0.4265 1.0271 0.9162 12.3109 7.6773 16.7864 7.5635 9.3821 0.7035 5.0030 12.8710 25.8088 11.4307 47.1301 0.8640 8.0450 0.8347 15.8052 2.0609 3.0269 0.3711 3.5599 3.3699 0.1451 0.1892 0.7136 53.9472 0.9671 17.8074 16.1446 1.6173 3.4222 15.0992 33.9298 20.8623 5.2715 11.6121 8.7863 7.0619 42.1076 7.5858 45.5052 1.9879 0.8613 2.2323 62.0060 12.2618 4.0448 24.6991 23.6222 22.9045 2.1742 10.9468 16.6578 12.4509 25.4159 15.3630 9.7942 7.1633 15.9978 1.2893 3.4477 13.5689 14.2540 23.8575 29.9199 20.2109 30.6146 26.1497 18.7238 13.9953
temp: 298.150 k
press: 1.00000 atm
elementType: 8 6 6 6 6 6 6 6 6 6 6 6 6 6 6 6 6 6 6 6 6 6 6 6 1 1 1 1 1 1 1 1 1 1 1 1 1 1 1 1 1 1 1 1 1 1
symmnumber: 1
zpe: 988709.4 jmol-1
zpe.correction: 0.376580 hartree
zpe.thermalcorrener: 0.397966 hartree
zpe.thermalcorrenthalpy: 0.398910 hartree
zpe.thermalcorrgfe: 0.327823 hartree
zpe.sumelectzpe: -963.165752 hartree
zpe.sumelectthermal: -963.144365 hartree
zpe.sumelectthermalent: -963.143421 hartree
zpe.sumelectthermalfe: -963.214508 hartree
dipole: 1.2308 2.3634 -1.1778
dipole: 2.9134
quadrupole: -129.5960 -137.0839 -140.3754
quadrupole: -3.8971 3.6330 5.1761
quadrupole: 6.0891 -1.3988 -4.6903 -3.8971 3.6330 5.1761
hfenergy: -963.5423311 hartree
pointgroup: C01 [X(C23H22O1)]
dipole: 0.5672452 0.8520631 -0.5157951 debye
polarizability: 265.5090421|-9.182271|247.9428037|4.5855859|-4.4141109|204.860238 unknown
InChI: InChI=1S/C23H22O/c1-17-11-7-9-15-21(17)23(19(3)24,20-13-5-4-6-14-20)22-16-10-8-12-18(22)2/h4-16H,1-3H3
charge 0 multiplicity 1
46 atoms
O  -0.860449 -0.811185 2.677105
C  -0.052517 0.018345 0.500807
C  -1.3712 -0.621645 -0.043788
C  1.201477 -0.887454 0.202256
C  0.215616 1.446456 -0.070842
C  -0.192085 0.07476 2.086041
C  -2.663447 -0.117888 0.324093
C  1.831673 -0.917994 -1.090126
C  -1.313588 -1.744912 -0.907032
C  1.723346 -1.732974 1.219164
C  -0.743127 2.166663 -0.826782
C  1.480949 2.062283 0.138666
C  0.520386 1.14456 2.901145
C  -3.819345 -0.726124 -0.230008
C  2.968692 -1.749077 -1.272586
C  -2.897198 1.003711 1.328732
C  1.352997 -0.141258 -2.310009
C  -2.473914 -2.346136 -1.438623
C  2.857494 -2.548012 1.015624
C  -3.742141 -1.827867 -1.106478
C  3.49731 -2.550408 -0.239691
C  -0.461198 3.45529 -1.334216
C  1.767255 3.349226 -0.361051
C  0.79277 4.060588 -1.099535
H  -0.341484 -2.177119 -1.158072
H  1.229168 -1.78439 2.19251
H  -1.71096 1.710132 -1.053787
H  2.266445 1.513982 0.670165
H  0.236602 1.022544 3.958357
H  0.273417 2.163243 2.557841
H  1.616775 1.033873 2.811056
H  -4.80263 -0.328522 0.051322
H  3.440317 -1.768366 -2.262879
H  -3.032687 0.581271 2.341795
H  -2.067033 1.726909 1.381734
H  -3.811362 1.569452 1.073947
H  1.730614 0.897494 -2.308459
H  1.718722 -0.629077 -3.231039
H  0.255059 -0.082962 -2.370268
H  -2.381711 -3.214238 -2.100651
H  3.224478 -3.179829 1.831886
H  -4.655635 -2.277545 -1.511581
H  4.379086 -3.175268 -0.419866
H  -1.223566 3.980105 -1.921206
H  2.754842 3.790082 -0.183626
H  1.012581 5.058674 -1.494444
