program: Gaussian 09
title: 000232064
version: EM64L-G09RevD.01
frameworkgroup: C1[X(C12H14O4)]
method: RPBEPBE
basis: SDD
operation: Freq
keyword: #pfreq=noraman
keyword: PBEPBE/SDD
title: #p freq=noraman PBEPBE/SDD
converged: YES YES NO NO
title: Mulliken charges:
elementType: O O O O C C C C C C C C C C C C H H H H H H H H H H H H H H
charge: -0.285265 -0.276711 -0.438289 -0.267743 0.172447 0.521968 0.262221 0.249793 -0.563746 -0.611580 -0.817334 -0.237768 -0.329909 -0.531068 -0.531511 0.141695 0.243934 0.246774 0.239065 0.225899 0.227382 0.294484 0.298071 0.249950 0.225420 0.225172 0.222861 0.252232 0.222873 0.368683
chargesum: 0.00000
title: Mulliken charges with hydrogens summed into heavy atoms:
elementType: O O O O C C C C C C C C C C C C
charge: -0.285265 -0.276711 -0.069606 -0.267743 0.172447 0.521968 0.262221 0.249793 -0.319812 -0.364806 -0.124988 0.056716 -0.031837 0.169474 0.166455 0.141695
polarizability: 2.58884607e+02 -9.27802713e-01 1.77102173e+02 -5.61078768e-01 -1.05238361e-01 7.30500976e+01
1716.lowfreq: -3.3468 -0.0006 -0.0006 -0.0003 4.7803 11.5387 31.0623 42.5436 47.6156
frequency: 31.0341 42.5059 47.6117 73.5025 80.4757 110.5748 160.8103 179.5165 183.9862 191.1008 204.9369 219.1046 227.4366 256.0123 271.7609 279.3112 354.0576 368.7865 388.2709 447.4484 500.2002 522.0191 560.5177 567.2160 590.1384 600.3661 609.0975 633.1601 688.3368 761.1729 804.1494 833.9664 845.3730 866.2716 901.2382 937.1030 945.3984 1007.1586 1011.0741 1032.8302 1041.7449 1047.3415 1090.8648 1110.6685 1114.3559 1156.5190 1159.0700 1163.8680 1198.0908 1228.1935 1249.7506 1304.1937 1316.4562 1329.3289 1387.9467 1396.2698 1410.5516 1443.7361 1446.0039 1464.0629 1469.4605 1470.1940 1470.9778 1472.4734 1476.3671 1487.9911 1576.7695 1605.0910 1620.2593 1637.6072 2965.3213 2967.8292 2976.2036 3055.7038 3057.3784 3059.9430 3087.5788 3128.5339 3129.7544 3130.5576 3159.3907 3165.2566 3224.9320 3520.9120
redmass: 1.0199 5.0004 7.1924 3.2053 6.0994 3.6121 4.3219 4.0366 2.8607 1.8361 3.4688 2.7233 4.4827 1.1945 5.7792 1.5236 4.5939 3.1020 3.8261 5.5696 5.0241 6.3545 4.2664 1.9798 1.7533 5.1406 4.6435 3.8660 3.7061 3.1925 4.9572 1.6529 1.4374 6.6025 1.8803 5.3506 7.1378 1.4978 4.8877 1.1497 1.6052 2.1857 4.7269 1.2587 1.2568 1.4008 1.6889 1.9137 1.5686 1.7167 1.7539 3.4553 1.8081 2.2700 4.4179 1.2472 1.9119 1.2569 1.2849 1.5100 1.0618 1.0777 1.0675 1.0563 1.1172 1.9378 6.4173 6.1700 7.1442 6.2429 1.0327 1.0323 1.0386 1.1041 1.0953 1.1043 1.0996 1.1002 1.0966 1.0916 1.0903 1.0908 1.0919 1.0638
irintensity: 0.2706 0.3766 0.2390 12.9609 0.6031 0.0142 0.9419 3.2473 0.5917 0.0031 0.4822 2.2596 0.0914 0.0001 1.4803 0.0081 1.7220 8.8039 2.5373 1.3456 49.9877 4.1359 13.5816 32.1266 103.6241 7.6819 1.6990 11.7245 30.0987 13.3885 22.6588 45.3742 0.3888 3.1963 17.6624 15.7891 6.4830 2.3558 19.7099 37.7253 100.4224 440.4703 266.9953 0.0736 0.2218 5.2748 2.6730 56.5281 138.7686 6.0897 38.1736 0.6144 97.2993 60.9649 34.7544 15.0377 89.5488 12.9039 11.8198 4.9976 18.2042 69.6467 42.8877 27.6172 8.0573 15.0785 134.6277 400.8072 271.2568 136.4071 74.6652 57.3762 38.1472 40.1198 21.5295 44.2825 19.5802 15.3497 12.7672 5.1231 11.6012 10.3621 0.5894 43.2650
temp: 298.150 k
press: 1.00000 atm
elementType: 8 8 8 8 6 6 6 6 6 6 6 6 6 6 6 6 1 1 1 1 1 1 1 1 1 1 1 1 1 1
symmnumber: 1
zpe: 617934.2 jmol-1
zpe.correction: 0.235359 hartree
zpe.thermalcorrener: 0.252186 hartree
zpe.thermalcorrenthalpy: 0.253130 hartree
zpe.thermalcorrgfe: 0.189812 hartree
zpe.sumelectzpe: -765.354588 hartree
zpe.sumelectthermal: -765.337761 hartree
zpe.sumelectthermalent: -765.336817 hartree
zpe.sumelectthermalfe: -765.400134 hartree
dipole: -5.9820 -1.9311 0.0556
dipole: 6.2862
quadrupole: -86.4855 -75.5989 -97.2264
quadrupole: -8.3023 -0.2228 0.0013
quadrupole: -0.0486 10.8380 -10.7895 -8.3023 -0.2228 0.0013
hfenergy: -765.5899463 hartree
pointgroup: C01 [X(C12H14O4)]
dipole: -2.4376597 -0.4175572 0.0048085 debye
polarizability: 256.8690683|-11.9649683|177.8218839|5.2612682|-11.2643165|74.3459258 unknown
InChI: InChI=1S/C12H14O4/c1-8-6-10(15-2)9(4-5-12(13)14)11(7-8)16-3/h4-7,13H,1-3H3
charge 0 multiplicity 1
30 atoms
O  0.109092 -2.210529 0.045985
O  -0.080467 2.554919 -0.452606
O  4.715074 -1.331911 0.087291
O  4.3438 0.950173 -0.177584
C  0.022399 0.176238 -0.200284
C  -2.863729 0.05236 -0.264756
C  -0.685609 -1.067916 -0.091416
C  -0.79099 1.354292 -0.344448
C  -2.097859 -1.12851 -0.126276
C  -2.20229 1.29654 -0.377805
C  -4.380549 -0.016975 -0.267276
C  1.471551 0.336229 -0.1813
C  2.452554 -0.618032 -0.051327
C  -0.552056 -3.51451 0.158143
C  -0.832275 3.801266 -0.60836
C  3.864443 -0.209356 -0.060275
H  -2.616193 -2.088109 -0.045546
H  -2.796748 2.207337 -0.489168
H  -4.774158 -0.097002 0.764762
H  -4.827475 0.883287 -0.722815
H  -4.744015 -0.898748 -0.824634
H  1.816705 1.372719 -0.285513
H  2.236904 -1.679212 0.060094
H  0.268929 -4.239369 0.257854
H  -1.14423 -3.742391 -0.748545
H  -1.201373 -3.558874 1.053145
H  -1.440436 3.790406 -1.533328
H  -0.065732 4.586617 -0.676451
H  -1.483906 3.989482 0.266421
H  5.655837 -1.00732 0.075917
