program: Gaussian 09
title: 000232000
version: EM64L-G09RevD.01
frameworkgroup: C1[X(C16H8O3)]
method: RPBEPBE
basis: SDD
operation: Freq
keyword: #pfreq=noraman
keyword: PBEPBE/SDD
title: #p freq=noraman PBEPBE/SDD
converged: YES YES YES YES
title: Mulliken charges:
elementType: O O O C C C C C C C C C C C C C C C C H H H H H H H H
charge: -0.215198 -0.171545 -0.171544 0.196064 0.196063 0.368574 0.368572 -0.123420 -0.123418 -0.431113 -0.431112 -0.385896 -0.385897 0.131419 0.131418 -0.246076 -0.246075 -0.251886 -0.251886 0.302888 0.302887 0.237724 0.237725 0.243824 0.243823 0.237041 0.237041
chargesum: 0.00000
title: Mulliken charges with hydrogens summed into heavy atoms:
elementType: O O O C C C C C C C C C C C C C C C C
charge: -0.215198 -0.171545 -0.171544 0.196064 0.196063 0.368574 0.368572 -0.123420 -0.123418 -0.128226 -0.128225 -0.148171 -0.148172 0.131419 0.131418 -0.002252 -0.002251 -0.014845 -0.014845
polarizability: 2.88761788e+02 1.62006913e-04 2.25178921e+02 6.52647289e-03 -4.33569047e-03 6.64133874e+01
1716.lowfreq: -5.2601 -3.7187 -0.0010 -0.0007 -0.0004 7.0848 58.0207 94.1461 114.3844
frequency: 58.0202 94.1460 114.3836 121.3667 164.8093 182.8735 233.2021 254.5257 299.4608 317.3156 345.3034 395.9781 402.9998 433.7689 447.4228 477.6287 520.6844 523.4032 579.3864 600.5601 608.6274 620.8059 661.1784 686.5554 696.0226 698.5052 747.3209 748.5647 754.6250 761.8999 784.3125 828.8735 860.3177 895.5418 915.8965 917.8505 975.5672 981.1585 987.8649 1006.6213 1008.6598 1042.0162 1044.7527 1063.4999 1090.6996 1126.3414 1162.0164 1184.2411 1188.5361 1256.5935 1295.4248 1297.8861 1319.8564 1380.2990 1385.8891 1409.0915 1436.5147 1447.6014 1456.5444 1508.0166 1528.8154 1569.6166 1600.9905 1622.0889 1624.7953 1674.9413 1730.0348 3136.9915 3138.6216 3152.4374 3155.3089 3164.0602 3169.6730 3174.8237 3177.7283
redmass: 8.6248 4.2906 6.2993 4.0774 14.9759 8.6551 5.2555 4.6062 6.1494 9.7908 10.2492 4.2390 6.7419 3.2472 11.0703 5.7161 3.8474 3.8607 3.4035 14.2317 7.7162 7.7181 6.5009 11.9656 8.2617 9.5883 6.5621 2.4240 11.7567 1.5419 1.6434 1.7305 8.5070 1.3923 2.3376 8.6480 1.4414 1.3660 7.4151 1.3431 1.3387 2.2442 2.5509 3.9757 4.0719 3.0955 1.4364 1.0709 1.1150 1.5807 2.9674 1.5884 3.0328 4.4578 5.7370 3.6433 2.5332 2.6329 3.1985 3.9798 3.7136 7.2935 6.6487 6.2229 7.8268 12.9236 12.7071 1.0860 1.0864 1.0900 1.0902 1.0955 1.0943 1.1005 1.0983
irintensity: 0.0000 1.6858 0.0005 0.0000 2.1800 1.6983 2.2707 0.0000 3.7652 2.6720 0.2170 0.0000 1.3640 9.3326 6.0506 1.8208 9.0113 0.0000 0.0000 5.5919 1.6640 22.7257 1.9228 0.0000 3.0677 0.0733 0.0257 56.3310 70.3727 0.0000 135.3565 0.0000 15.4030 2.2928 0.0000 20.5149 0.0000 5.2568 0.0389 0.0000 0.5095 7.5946 0.2394 4.4832 118.6266 149.7638 11.1058 3.3503 0.4570 2.1963 5.9894 3.5323 44.4806 5.0851 0.4517 22.0778 36.2182 53.3647 4.7291 0.0699 22.0409 13.0928 0.0021 21.0825 16.7660 470.5225 220.5412 0.1236 6.2297 17.8361 0.0035 0.3162 3.7331 25.8772 33.3833
temp: 298.150 k
press: 1.00000 atm
elementType: 8 8 8 6 6 6 6 6 6 6 6 6 6 6 6 6 6 6 6 1 1 1 1 1 1 1 1
symmnumber: 1
zpe: 505008.1 jmol-1
zpe.correction: 0.192347 hartree
zpe.thermalcorrener: 0.205704 hartree
zpe.thermalcorrenthalpy: 0.206648 hartree
zpe.thermalcorrgfe: 0.152440 hartree
zpe.sumelectzpe: -838.959208 hartree
zpe.sumelectthermal: -838.945851 hartree
zpe.sumelectthermalent: -838.944907 hartree
zpe.sumelectthermalfe: -838.999115 hartree
dipole: 0.0000 -7.6041 0.0002
dipole: 7.6041
quadrupole: -97.0450 -115.7439 -110.8456
quadrupole: 0.0001 0.0003 0.0001
quadrupole: 10.8332 -7.8657 -2.9675 0.0001 0.0003 0.0001
hfenergy: -839.1515552 hartree
pointgroup: C01 [X(C16H8O3)]
dipole: -0.0000254 -2.9916885 0.0000773 debye
dipolederiv: -0.9852203 0.0000034 -0.0000261 0.0000012 -0.8641518 0.0000163 -0.0000179 0.0000104 -0.2193642 -0.9866714 0.3749001 -0.0000307 0.3322351 -0.7217968 0.000021 -0.0000379 0.0000272 -0.2982513 -0.986688 -0.374897 -0.0000037 -0.3322325 -0.7217838 0.0000048 -0.0000183 -0.0000044 -0.2982502 0.0565027 -0.0849413 0.0000035 0.2960953 0.1135685 0.0000062 -0.0000061 -0.0000052 0.0260511 0.0564953 0.0849422 -0.0000013 -0.2960931 0.1135715 -0.000011 0.0000097 0. 0.0260509 0.0199449 0.1072148 -0.0000031 -0.2044133 -0.2915166 0.0000037 0.0000055 0.0000152 0.0329847 0.0199487 -0.1072237 0.0000024 0.2044073 -0.291515 0.0000133 -0.0000024 0.0000033 0.0329844 -0.1036364 0.6410781 -0.0000221 0.5872117 -0.3345429 0.0000258 -0.000018 0.0000245 -0.009579 -0.1036662 -0.6410827 0.0000151 -0.5872178 -0.334524 -0.00001 0.0000131 -0.0000082 -0.0095793 0.0022186 0.0428395 0.0000021 -0.1076055 0.049951 -0.0000081 0.0000058 -0.0000061 -0.1320938 0.0022194 -0.042836 0.0000047 0.1076062 0.0499489 -0.0000022 -0.0000006 -0.0000043 -0.1320938 -0.2429817 -0.1061909 0.0000003 -0.1194566 0.070024 -0.0000095 0. -0.0000087 -0.1502877 -0.2429747 0.1061959 -0.0000055 0.1194611 0.0700191 -0.0000026 -0.0000068 -0.0000031 -0.1502878 1.4884499 -0.3093508 0.0000513 -0.4171266 1.5184129 -0.0000432 0.0000559 -0.0000403 0.2914876 1.4884694 0.3093529 0.0000178 0.4171317 1.5184048 -0.0000223 0.000022 -0.0000182 0.2914875 0.1724096 -0.0173277 0.0000098 -0.0838864 -0.1950368 -0.0000012 0.0000125 0.0000008 -0.1478846 0.1724131 0.0173203 0.0000087 0.0838798 -0.1950366 0.0000038 0.000007 0.0000019 -0.1478842 0.0039607 0.021764 0.0000033 0.0670382 0.1825422 -0.0000068 0.000002 -0.0000084 -0.1295426 0.0039564 -0.0217609 0.0000041 -0.0670352 0.1825434 -0.0000103 0.0000052 -0.0000081 -0.129543 0.1081639 0.0126118 -0.0000015 0.0817786 0.055924 0.0000052 -0.0000037 0.0000032 0.1625519 0.1081621 -0.0126127 -0.000001 -0.0817797 0.0559252 0.0000008 0.0000013 0.0000029 0.1625519 0.0582414 0.1113147 -0.0000055 0.0436607 -0.045297 0.0000063 -0.0000039 0.0000085 0.1460395 0.0582382 -0.1113166 0.0000005 -0.0436626 -0.0452936 0.0000042 -0.0000014 0.000002 0.1460396 -0.114778 -0.011941 -0.0000077 -0.000802 0.0892584 0.0000019 -0.0000083 0.000002 0.1612861 -0.1147789 0.0119452 -0.0000082 0.0008065 0.0892581 0.000002 -0.0000081 0.0000019 0.1612858 0.0307988 -0.0855971 -0.0000012 -0.1067538 -0.0594267 0.0000029 -0.0000008 0.0000034 0.1569201 0.0308026 0.0855954 -0.0000058 0.1067518 -0.0594303 0.0000088 -0.0000059 0.0000079 0.1569202 unknown
polarizability: 288.761788|-0.0005338|225.1789205|0.0065264|-0.0043358|66.4133874 unknown
InChI: InChI=1S/C16H8O3/c17-15-13-11-7-3-1-5-9(11)10-6-2-4-8-12(10)14(13)16(18)19-15/h1-8H
charge 0 multiplicity 1
27 atoms
O  0.000023 3.343797 -0.000051
O  -2.317121 2.971018 -0.000134
O  2.317161 2.970974 0.000018
C  -0.735445 -1.382746 0.000042
C  0.735399 -1.38276 0.000085
C  -1.466824 -0.132554 -0.000015
C  1.466804 -0.132584 0.000072
C  -0.695988 1.079538 -0.000025
C  0.695991 1.079524 0.000014
C  -2.896709 -0.12612 -0.000056
C  2.896689 -0.126178 0.000112
C  -1.49719 -2.590691 0.000053
C  1.49712 -2.590721 0.00014
C  -1.176537 2.489545 -0.000069
C  1.176569 2.489521 -0.000016
C  -3.605071 -1.331818 -0.000042
C  3.605026 -1.33189 0.000165
C  -2.898468 -2.56875 0.000012
C  2.898399 -2.568808 0.00018
H  -3.4190 0.834781 -0.000097
H  3.418999 0.834713 0.000099
H  -0.991218 -3.559696 0.000094
H  0.991129 -3.559715 0.000152
H  -4.699765 -1.327568 -0.000074
H  4.699721 -1.327663 0.000196
H  -3.455441 -3.511838 0.000022
H  3.455353 -3.511907 0.000221
