program: Gaussian 09
title: 000231988
version: EM64L-G09RevD.01
frameworkgroup: C1[X(C10H11NO3)]
method: RPBEPBE
basis: SDD
operation: Freq
keyword: #p
keyword: freq=noraman
keyword: PBEPBE/SDD
title: #p freq=noraman PBEPBE/SDD
converged: YES YES NO NO
title: Mulliken charges:
elementType: O O O N C C C C C C C C C C H H H H H H H H H H H
charge: -0.289021 -0.255126 -0.236026 -0.447920 0.526481 -0.555149 0.386109 -0.378116 -0.423390 -0.176346 0.212044 -0.798629 0.269001 -0.757151 0.296792 0.312410 0.257257 0.231914 0.317840 0.238198 0.268781 0.238342 0.260080 0.250800 0.250822
chargesum: 0.00000
title: Mulliken charges with hydrogens summed into heavy atoms:
elementType: O O O N C C C C C C C C C C
charge: -0.289021 -0.255126 -0.236026 -0.130079 0.526481 -0.258356 0.386109 -0.065706 -0.166133 0.055569 0.212044 -0.053307 0.269001 0.004552
polarizability: 1.91730562e+02 -6.46900546e-01 1.41186134e+02 -1.61576676e-02 4.39155003e-02 6.09490786e+01
1716.lowfreq: -74.0938 -72.1491 -5.9160 -0.0007 0.0005 0.0007 3.5967 10.2190 38.9647
frequency: -74.0890 -72.1435 38.8800 50.1934 88.7045 99.2790 99.5126 184.9201 253.3963 262.2717 263.2414 320.5157 335.7344 396.9276 452.5289 505.6076 523.7870 557.7389 576.1876 608.0416 649.2126 652.2443 659.8875 698.5563 750.9993 805.5717 839.2340 899.5581 904.3441 920.1170 961.3788 982.3889 995.4256 997.2356 1012.7316 1032.1650 1045.0615 1087.1317 1131.7636 1175.5378 1178.0757 1224.5098 1268.3295 1307.3262 1378.0260 1382.8905 1385.4554 1409.9992 1451.0019 1453.9124 1458.0477 1468.6214 1480.7416 1518.7211 1602.3106 1609.5142 1635.3997 1645.4960 2988.8012 3008.4419 3073.8338 3094.7314 3137.1810 3144.6480 3146.5859 3177.4249 3179.9432 3202.1733 3521.3293
redmass: 1.0604 1.0527 5.7797 5.5929 3.6799 4.7315 4.2539 5.7236 3.8024 5.4231 5.5122 4.7193 4.0401 5.1998 3.0463 4.4305 4.2389 3.2548 3.2465 2.6770 5.8941 6.6110 1.4245 2.2070 6.2179 1.4032 5.4762 5.6351 1.5347 1.3764 3.0129 5.3687 1.3139 1.8291 2.0095 1.6577 1.6038 1.5242 1.9454 1.3733 2.3890 3.2150 2.1220 1.5525 1.3075 3.4389 1.2744 3.3954 1.1191 1.0659 1.0456 1.0465 2.8123 2.0135 6.3101 6.0991 5.0527 10.8754 1.0384 1.0369 1.0984 1.0972 1.0980 1.1009 1.0888 1.0953 1.0928 1.0955 1.0766
irintensity: 0.0573 1.1958 6.5936 3.3365 7.1476 3.9304 1.5337 5.5387 0.8701 3.5436 0.0006 3.5739 2.5109 0.5373 6.5193 19.5264 11.2307 0.0009 3.2659 12.5913 1.5875 7.6343 64.4934 24.3653 2.5934 53.1451 9.9839 33.1437 61.7093 1.1968 8.0480 2.4805 5.5943 12.3347 86.3336 8.0624 10.0423 17.9289 106.3957 121.7469 415.9853 84.8442 45.4890 75.1366 23.9671 186.3813 20.8465 109.2651 18.5527 18.9770 18.1041 19.9495 201.7659 192.2206 174.4396 30.3501 112.2296 211.1274 7.7873 3.2499 14.9154 5.9948 7.4862 7.2685 12.5660 4.6311 9.7119 7.1275 13.5901
temp: 298.150 k
press: 1.00000 atm
elementType: 8 8 8 7 6 6 6 6 6 6 6 6 6 6 1 1 1 1 1 1 1 1 1 1 1
symmnumber: 1
zpe: 504533.9 jmol-1
zpe.correction: 0.192167 hartree
zpe.thermalcorrener: 0.204574 hartree
zpe.thermalcorrenthalpy: 0.205518 hartree
zpe.thermalcorrgfe: 0.152050 hartree
zpe.sumelectzpe: -667.085532 hartree
zpe.sumelectthermal: -667.073125 hartree
zpe.sumelectthermalent: -667.072181 hartree
zpe.sumelectthermalfe: -667.125649 hartree
dipole: -2.4734 -1.8231 0.0001
dipole: 3.0727
quadrupole: -76.4711 -76.4171 -83.7963
quadrupole: -12.8552 -0.0273 -0.0056
quadrupole: 2.4237 2.4777 -4.9015 -12.8552 -0.0273 -0.0056
hfenergy: -667.2776991 hartree
pointgroup: C01 [X(C10H11N1O3)]
dipole: 0.9414612 -0.757089 0.043424 debye
dipolederiv: -1.4039654 0.6445742 -0.0286048 1.0178004 -1.1806682 0.0617717 -0.0589032 0.0690909 -0.1874367 -0.9734893 -0.0139463 0.0125536 0.5314784 -0.6874509 0.0186761 -0.0328937 0.0284248 -0.3424227 -0.6143776 -0.2943444 0.0302604 0.3350016 -1.0048225 0.0498379 -0.0216507 0.062475 -0.3243952 -1.8625227 -0.425498 0.0628057 -0.3865809 -0.4463719 0.017066 0.0580488 0.0179385 -0.3299032 0.8571191 0.4017222 -0.0474334 0.8224988 0.4611537 -0.0441454 -0.0811136 -0.0363545 0.1154273 -0.5508284 -0.1052304 0.0150475 -0.0107121 -0.150335 -0.0050324 0.0074293 -0.0031942 -0.2128498 1.1620418 -0.4142063 0.0131937 -0.3625817 0.4268521 -0.0182443 0.008446 -0.0170753 0.1174459 -0.1995392 -0.0092595 0.0006823 -0.3001644 -0.2550414 0.011721 0.0246154 0.0063388 -0.1826178 -0.3109518 0.1091232 -0.0070258 0.1520098 -0.2035609 -0.0032477 -0.010278 -0.0022502 -0.2031691 0.1925623 -0.0296842 -0.0041617 0.0230101 0.2043146 -0.0280752 -0.0082301 -0.0271785 -0.1308008 2.1671907 0.2541094 -0.0557755 -0.4141102 0.9122801 -0.05294 0.0001967 -0.0650988 0.1734844 -0.1791108 -0.1580832 0.0168195 -0.2996518 -0.332905 0.0370311 0.0286835 0.0346646 0.0539096 1.4047864 -0.099418 -0.0156911 -1.1451174 1.8434076 -0.1107436 0.0704738 -0.1316294 0.2315356 -0.4756389 0.0687153 0.0040791 0.1622126 -0.0410209 0.0010846 -0.0040187 0.0029995 0.0113853 0.1906545 -0.0378505 0.0031953 -0.06432 0.0164402 0.0156918 0.0052899 0.0151232 0.1914737 0.103093 0.065622 -0.0033757 0.0451498 0.1328255 0.0036706 -0.0017817 0.0033354 0.1881125 -0.0040867 -0.0832165 0.0106122 -0.0787152 0.0633517 0.0113674 0.0102089 0.0115266 0.1810098 0.0698992 0.034421 -0.0011467 0.020712 -0.1096438 0.0210167 -0.0000464 0.0207201 0.1502341 0.1639011 0.0503095 -0.0016401 0.0011872 0.1072473 0.0158766 0.0024895 0.0147201 0.3009842 0.0680712 0.0230753 0.0734191 -0.0176632 0.0093881 -0.082017 0.0311909 -0.1101757 -0.016632 -0.0739853 0.001723 0.0030189 0.0678431 0.0882663 0.0025227 -0.0025427 0.003431 0.1311156 0.0649536 0.0136678 -0.0790242 -0.0204908 0.0395388 0.0737766 -0.0309576 0.100543 -0.0434827 0.0845305 -0.0341281 0.0038162 -0.0982314 -0.0456462 0.0167761 0.0092659 0.0154248 0.1286394 0.0616955 0.019023 0.0195595 0.0136887 0.0613636 -0.0971954 0.0677011 -0.0919581 0.0124298 0.0579971 0.0187796 -0.0251841 0.005747 0.0910368 0.0837543 -0.0716237 0.0781586 -0.0134774 unknown
polarizability: 191.6450772|-1.7097079|140.6940525|-2.3905964|-6.4926122|61.5266441 unknown
InChI: InChI=1S/C10H11NO3/c1-7(12)11-9-4-3-5-10(6-9)14-8(2)13/h3-6,11H,1-2H3
charge 0 multiplicity 1
25 atoms
O  2.733334 0.159963 -0.147322
O  -4.022929 0.583536 -0.05273
O  2.497233 -2.176957 0.050081
N  -2.112271 -0.782633 0.026651
C  -1.056026 0.167618 -0.071593
C  0.266307 -0.35725 -0.054893
C  1.351322 0.536957 -0.150167
C  -1.279325 1.564999 -0.181409
C  1.154556 1.931523 -0.26103
C  -0.164457 2.426636 -0.274964
C  -3.494027 -0.562459 0.031901
C  -4.31663 -1.846625 0.149719
C  3.216846 -1.15974 -0.0484
C  4.729566 -1.151019 -0.079943
H  0.44736 -1.431004 0.029492
H  -2.300867 1.94674 -0.191203
H  2.023253 2.59136 -0.333014
H  -0.331412 3.505582 -0.360196
H  -1.813017 -1.758323 0.101011
H  -4.116771 -2.531034 -0.695578
H  -5.382946 -1.579921 0.143948
H  -4.090223 -2.385183 1.088722
H  5.124964 -0.130296 -0.173729
H  5.079044 -1.766381 -0.927281
H  5.115018 -1.61769 0.84333
