program: Gaussian 09
title: 000231986
version: EM64L-G09RevD.01
frameworkgroup: C1[X(C8H16O3)]
method: RPBEPBE
basis: SDD
operation: Freq
keyword: #pfreq=noraman
keyword: PBEPBE/SDD
title: #p freq=noraman PBEPBE/SDD
converged: YES YES NO NO
title: Mulliken charges:
elementType: O O O C C C C C C C C H H H H H H H H H H H H H H H H
charge: -0.450025 -0.257065 -0.280839 -0.191019 -0.088188 -0.360571 0.243226 -0.714162 -0.699852 -0.266675 -0.666393 0.226980 0.217412 0.204694 0.236124 0.206109 0.241495 0.221984 0.225069 0.212914 0.219468 0.358140 0.236287 0.225916 0.220795 0.228108 0.250070
chargesum: 0.00000
title: Mulliken charges with hydrogens summed into heavy atoms:
elementType: O O O C C C C C C C C
charge: -0.091886 -0.257065 -0.280839 0.035961 0.129224 0.080247 0.243226 -0.044573 -0.042401 0.195527 0.032580
polarizability: 1.11821676e+02 -2.10404245e+00 9.33850123e+01 -1.25861144e+00 -4.55822392e-01 8.51018988e+01
1716.lowfreq: -22.7696 -6.9896 -0.0008 -0.0008 -0.0007 8.8730 29.4560 53.8026 74.4164
frequency: 28.2560 53.5293 74.3924 94.1142 107.1366 151.9402 171.0621 185.7232 219.6194 230.0484 257.2410 300.1784 319.7836 330.9773 389.1476 425.9619 469.7976 524.4641 549.6736 678.4986 718.2985 758.9650 793.1643 810.7198 827.9427 864.7430 910.4112 940.3268 1003.8041 1010.0102 1041.9622 1063.1578 1091.9328 1097.2844 1112.6441 1129.9480 1141.4507 1155.7621 1230.9795 1242.5817 1276.6003 1278.2591 1317.6208 1323.0285 1346.0158 1365.9598 1381.7994 1389.9776 1395.7544 1398.3621 1454.0550 1462.2040 1464.6159 1469.7807 1477.0376 1477.8671 1481.3877 1485.5485 1599.1313 2978.0033 2978.9786 2989.1814 2993.7679 3019.3362 3028.1261 3032.0799 3051.2399 3072.8617 3076.6108 3079.6762 3088.8752 3094.1477 3095.0344 3121.7898 3430.5334
redmass: 3.5790 2.7983 2.4046 4.1817 2.5950 3.0775 3.2860 1.9035 1.1259 1.2196 1.4217 3.9289 3.2312 3.5069 2.8393 3.8146 2.8658 2.4331 1.2822 2.7969 4.4229 1.6149 3.0547 1.2876 2.7318 2.0942 2.0656 2.1940 1.8771 2.6503 1.7051 2.3497 1.9835 2.0449 2.0487 2.7449 2.3686 1.7167 1.4858 1.3438 1.1884 1.1285 1.4015 1.3875 1.2832 1.4583 1.2242 1.2303 1.2112 1.2266 1.1066 1.0598 1.0431 1.0640 1.0437 1.0494 1.0685 1.0501 7.1079 1.0362 1.0358 1.0633 1.0360 1.0856 1.0858 1.0596 1.0976 1.0991 1.0994 1.1001 1.0974 1.0989 1.1030 1.1066 1.0655
irintensity: 0.2526 0.5052 0.6613 1.9776 1.1014 0.8047 1.9987 0.8074 0.8589 2.7132 1.3258 7.7489 6.3084 16.8383 4.3353 3.9580 0.4648 28.8057 170.7727 6.8510 4.1747 10.7812 8.2008 3.9142 6.8582 8.3976 9.7386 4.0703 36.7736 52.5649 6.3087 20.6752 57.5387 11.9036 127.2695 56.6317 130.2939 25.2727 29.7781 25.3874 0.3184 6.1259 22.4636 10.2270 23.3543 45.3970 23.6107 19.1109 30.3106 22.8328 14.6533 9.7127 12.7583 12.4919 11.2342 11.6637 15.0437 17.7720 111.6932 24.5350 23.1749 22.8164 16.6885 21.5599 9.7219 27.6000 0.7076 28.7759 58.2460 69.3542 31.7550 28.7362 1.3288 30.4929 54.2959
temp: 298.150 k
press: 1.00000 atm
elementType: 8 8 8 6 6 6 6 6 6 6 6 1 1 1 1 1 1 1 1 1 1 1 1 1 1 1 1
symmnumber: 1
zpe: 607002.4 jmol-1
zpe.correction: 0.231195 hartree
zpe.thermalcorrener: 0.244934 hartree
zpe.thermalcorrenthalpy: 0.245878 hartree
zpe.thermalcorrgfe: 0.190343 hartree
zpe.sumelectzpe: -539.215492 hartree
zpe.sumelectthermal: -539.201754 hartree
zpe.sumelectthermalent: -539.200809 hartree
zpe.sumelectthermalfe: -539.256344 hartree
dipole: 2.8783 0.1442 -2.3557
dipole: 3.7222
quadrupole: -66.7538 -65.2407 -71.8597
quadrupole: -3.2153 6.0134 1.2574
quadrupole: 1.1976 2.7107 -3.9083 -3.2153 6.0134 1.2574
hfenergy: -539.4466873 hartree
pointgroup: C01 [X(C8H16O3)]
dipole: 1.154311 -0.0480166 0.899888 debye
polarizability: 112.05956|-1.0079016|92.5711894|0.0005804|-2.2499958|85.6778376 unknown
InChI: InChI=1S/C8H16O3/c1-4-7(6(3)9)8(10)11-5-2/h6-7,9H,4-5H2,1-3H3
charge 0 multiplicity 1
27 atoms
O  -2.434739 0.572747 -1.142624
O  1.463667 0.444637 0.77632
O  0.401144 0.526074 -1.292641
C  -0.891215 -0.11257 0.712235
C  -2.100673 0.780375 0.273096
C  -1.201383 -1.621933 0.472914
C  0.356659 0.307178 -0.049168
C  -1.892663 2.275807 0.583452
C  -0.082997 -2.578329 0.934158
C  2.758102 0.828842 0.119674
C  3.480014 -0.406688 -0.423496
H  -0.701478 0.045939 1.790097
H  -2.990731 0.411633 0.816455
H  -2.135886 -1.850241 1.022721
H  -1.427317 -1.768221 -0.59934
H  -1.743833 2.446013 1.666485
H  -2.78131 2.842733 0.257983
H  -1.016506 2.68109 0.043727
H  0.849139 -2.425773 0.359909
H  0.157258 -2.432501 2.003785
H  -0.392478 -3.63006 0.79497
H  -1.589647 0.685284 -1.662672
H  2.538209 1.552868 -0.684235
H  3.319266 1.315804 0.932672
H  4.469746 -0.113349 -0.819908
H  3.636211 -1.1551 0.372473
H  2.905644 -0.867457 -1.244442
