program: Gaussian 09
title: 000231998
version: EM64L-G09RevD.01
frameworkgroup: C1[X(C13H24O4)]
method: RPBEPBE
basis: SDD
operation: Freq
keyword: #pfreq=noraman
keyword: PBEPBE/SDD
title: #p freq=noraman PBEPBE/SDD
converged: YES YES NO NO
title: Mulliken charges:
elementType: O O O O C C C C C C C C C C C C C H H H H H H H H H H H H H H H H H H H H H H H H
charge: -0.266529 -0.418002 -0.236774 -0.231149 -0.383932 -0.384042 -0.385232 -0.384987 -0.368732 -0.368906 -0.376520 -0.376188 -0.504114 -0.487985 0.228131 0.170742 -0.506266 0.193916 0.193959 0.194047 0.194038 0.196204 0.196047 0.196352 0.196318 0.190630 0.191080 0.191659 0.191605 0.217736 0.214886 0.217623 0.218010 0.246986 0.246164 0.252378 0.252287 0.375050 0.240418 0.232595 0.240494
chargesum: 0.00000
title: Mulliken charges with hydrogens summed into heavy atoms:
elementType: O O O O C C C C C C C C C C C C C
charge: -0.266529 -0.042952 -0.236774 -0.231149 0.003943 0.004044 0.007019 0.007684 0.012978 0.014359 0.056102 0.059445 -0.010963 0.016681 0.228131 0.170742 0.207240
polarizability: 2.13632164e+02 -2.32980330e+00 1.39426769e+02 2.60634358e-01 2.03741487e-02 1.11621366e+02
1716.lowfreq: -1.8971 -0.0016 0.0003 0.0007 5.1522 7.7158 12.6801 17.2344 21.6054
frequency: 9.9123 16.5476 21.5737 34.7530 43.8634 59.5759 60.4905 77.2158 94.3515 105.3997 114.3252 117.3600 131.2097 132.4218 151.3513 158.9217 176.5631 184.7635 249.8691 270.0681 312.9402 362.7298 407.7977 451.2191 490.1285 500.3937 508.6672 549.3361 588.5706 635.1903 658.8538 723.9079 724.1610 729.9874 750.7373 787.9576 832.7735 838.2627 856.6710 895.9196 945.6173 958.4794 986.4550 994.5853 1016.6266 1022.1609 1040.2523 1055.3418 1075.2112 1080.3053 1081.4012 1086.0631 1106.8739 1112.3251 1113.9619 1118.2040 1132.5988 1148.9289 1193.3849 1204.6204 1221.2942 1231.0071 1249.5458 1250.3267 1273.5547 1274.3199 1280.0495 1289.6627 1290.8012 1299.8965 1300.6422 1301.4367 1326.1644 1347.4737 1358.0120 1359.7121 1365.8770 1373.1427 1422.9141 1438.1716 1440.5320 1453.4006 1461.6282 1462.2789 1464.8191 1465.4837 1465.6600 1471.9385 1479.1939 1485.6433 1489.7769 1648.3087 1669.3543 2950.3641 2951.6044 2953.0523 2953.5583 2960.6969 2966.5394 2984.8094 2986.0901 2986.7352 2989.1262 2995.2274 2995.6311 2996.0859 3002.5884 3007.6457 3023.2442 3030.0639 3033.0198 3041.2232 3061.9257 3062.4078 3103.1899 3146.9679 3512.3408
redmass: 9.0592 4.9922 5.3159 3.5722 2.6381 4.1543 2.4288 2.0723 2.1347 1.0877 4.8162 1.9848 2.1458 6.3669 2.0245 2.0723 2.9076 4.3905 4.1669 5.1934 4.2993 4.1292 4.3282 3.5442 3.5456 1.7600 3.1881 2.6508 4.6700 1.3303 4.9266 1.0606 1.0812 1.1254 1.2032 1.2931 6.0000 1.3560 4.8589 1.3558 6.6311 1.2991 4.9889 5.0448 1.1691 3.4031 3.8293 2.8809 2.5599 2.5684 2.1014 2.2655 4.0474 1.3974 1.3438 1.3969 3.5061 1.4362 1.6759 1.2715 1.4297 1.3657 1.4374 1.3006 1.4075 1.2042 1.0269 1.0644 1.1170 1.1568 1.3499 1.1197 1.4895 1.5454 1.7104 1.6030 1.7059 1.8403 1.1888 1.0846 1.0834 1.0501 1.0747 1.0701 1.0555 1.0600 1.0765 1.0928 1.0976 1.0999 1.1006 9.0467 8.2258 1.0588 1.0586 1.0591 1.0595 1.0595 1.0586 1.0963 1.0613 1.0612 1.0978 1.0926 1.0668 1.0595 1.0298 1.1029 1.1029 1.0995 1.1008 1.1044 1.1032 1.1031 1.1045 1.1046 1.0639
irintensity: 2.5227 0.1922 0.3803 0.0025 0.0145 0.1032 0.1833 0.2239 0.2134 0.2532 2.1557 0.1585 0.0052 0.0042 0.7339 0.2159 10.2535 1.8585 1.7471 17.9816 5.1426 1.4247 5.9919 2.2682 24.6971 30.4835 5.3336 1.7694 13.3964 127.4222 6.2494 24.4469 0.2799 6.7522 0.1666 5.7062 12.2584 0.0488 1.1866 2.9997 11.3617 0.0043 35.0051 18.0006 0.8886 151.6308 25.1839 82.0899 6.5266 4.2687 2.3922 1.2444 78.0092 0.6862 0.6855 1.4421 203.7117 4.2150 0.0088 76.3750 0.1511 4.4797 3.4118 0.0738 48.0696 3.8896 0.0498 0.1524 0.0045 0.0134 0.0702 0.1436 51.4729 0.0265 0.1154 13.0526 12.6809 29.3784 22.3495 27.8548 21.5562 13.9300 0.0187 0.4135 8.9744 0.8456 3.6937 0.0452 6.4936 0.0024 34.8721 161.6678 209.1613 0.1986 9.4692 0.0525 2.8572 0.0611 175.4495 0.0165 5.1048 4.9826 3.2414 7.0889 28.7601 47.1023 35.3277 5.7580 0.0092 6.4660 0.0196 120.1533 6.6445 172.8159 29.7476 17.6468 17.7362
temp: 298.150 k
press: 1.00000 atm
elementType: 8 8 8 8 6 6 6 6 6 6 6 6 6 6 6 6 6 1 1 1 1 1 1 1 1 1 1 1 1 1 1 1 1 1 1 1 1 1 1 1 1
symmnumber: 1
zpe: 925289.3 jmol-1
zpe.correction: 0.352424 hartree
zpe.thermalcorrener: 0.373948 hartree
zpe.thermalcorrenthalpy: 0.374892 hartree
zpe.thermalcorrgfe: 0.295910 hartree
zpe.sumelectzpe: -809.310155 hartree
zpe.sumelectthermal: -809.288631 hartree
zpe.sumelectthermalent: -809.287687 hartree
zpe.sumelectthermalfe: -809.366669 hartree
dipole: 0.7740 -0.0760 0.0672
dipole: 0.7806
quadrupole: -93.0197 -116.2217 -101.5704
quadrupole: -19.1462 0.1344 0.1080
quadrupole: 10.5842 -12.6178 2.0335 -19.1462 0.1344 0.1080
hfenergy: -809.6625791 hartree
pointgroup: C01 [X(C13H24O4)]
dipole: 0.3044423 0.029921 -0.0272327 debye
polarizability: 213.618672|2.5313316|139.414096|-0.286982|-0.8570176|111.64753 unknown
InChI: InChI=1S/C13H24O4/c1-17-13(16)11-9-7-5-3-2-4-6-8-10-12(14)15/h14H,2-11H2,1H3
charge 0 multiplicity 1
41 atoms
O  7.602284 0.750286 -0.025638
O  -8.731819 -0.773638 0.035367
O  6.655145 -1.372086 0.123649
O  -7.788347 1.346627 -0.000869
C  0.06799 0.440175 0.013238
C  -1.189609 -0.457685 0.01983
C  1.389858 -0.360031 0.017669
C  -2.511385 0.34268 0.015962
C  2.647179 0.538134 0.012061
C  -3.768592 -0.555595 0.023491
C  3.963425 -0.269605 0.019826
C  -5.084646 0.252581 0.018663
C  5.205645 0.641686 0.012413
C  -6.325754 -0.659612 0.027478
C  6.514104 -0.130868 0.043975
C  -7.633808 0.106205 0.018732
C  8.942804 0.117031 0.0068
H  0.042967 1.111757 0.896982
H  0.041909 1.100454 -0.878962
H  -1.163224 -1.118034 0.911955
H  -1.164704 -1.12915 -0.863994
H  1.415777 -1.020482 0.909425
H  1.415233 -1.031318 -0.865982
H  -2.537882 1.002539 -0.876203
H  -2.535823 1.014442 0.899248
H  2.619015 1.210179 0.895654
H  2.620506 1.197488 -0.881049
H  -3.740383 -1.214805 0.916615
H  -3.741885 -1.227585 -0.8601
H  3.996273 -0.927608 0.909199
H  3.99593 -0.943154 -0.858173
H  -5.116241 0.925198 0.89724
H  -5.118567 0.91116 -0.870359
H  5.214428 1.296327 -0.880833
H  5.195512 1.327911 0.882537
H  -6.327557 -1.322157 0.915513
H  -6.326583 -1.3394 -0.847546
H  -9.573668 -0.241513 0.028218
H  9.07546 -0.452244 0.942361
H  9.650952 0.955471 -0.051115
H  9.064681 -0.566562 -0.850379
