program: Gaussian 09
title: 000231995
version: EM64L-G09RevD.01
frameworkgroup: C1[X(C13H14BrClO2)]
method: RPBEPBE
basis: SDD
operation: Freq
keyword: #p
keyword: freq=noraman
keyword: PBEPBE/SDD
title: #p freq=noraman PBEPBE/SDD
converged: YES YES NO NO
title: Mulliken charges:
elementType: Br Cl O O C C C C C C C C C C C C C H H H H H H H H H H H H H H
charge: -0.005225 -0.017742 -0.396157 -0.240294 0.195058 0.407149 0.388995 0.582548 -0.556426 -0.682100 -0.414698 -0.833288 -0.830762 -0.832695 0.310271 -0.790551 0.097980 0.247718 0.261117 0.251594 0.258447 0.245162 0.232064 0.248026 0.253563 0.255268 0.231219 0.248185 0.240971 0.260171 0.384429
chargesum: 0.00000
title: Mulliken charges with hydrogens summed into heavy atoms:
elementType: Br Cl O O C C C C C C C C C C C C C
charge: -0.005225 -0.017742 -0.011728 -0.240294 0.195058 0.407149 0.388995 0.582548 -0.556426 -0.434382 -0.414698 -0.062130 -0.105509 -0.092644 0.310271 -0.041223 0.097980
polarizability: 2.45155589e+02 6.66604590e-01 1.68091503e+02 -3.68376693e+00 -2.99669155e+00 1.30849045e+02
1716.lowfreq: -9.7819 -6.3945 -5.6070 -0.0012 -0.0006 0.0012 16.9238 22.4524 48.8940
frequency: 16.8650 22.2596 48.8815 52.3668 77.9269 111.3639 119.4246 135.9496 142.0668 146.5334 159.0265 170.8431 188.6630 203.8862 214.5645 243.4921 283.8350 292.1453 295.3447 326.2376 338.5200 373.2646 403.8292 467.3491 501.0277 533.6469 542.3565 549.7429 570.3320 595.3067 601.0977 630.5137 655.7316 728.1557 737.7097 811.5812 845.2878 878.1854 943.1295 967.3675 1009.0724 1017.9332 1029.9200 1039.7618 1040.8679 1044.0440 1044.3681 1048.8872 1050.5514 1161.9058 1192.8682 1242.3576 1317.4346 1328.2523 1340.0200 1379.8930 1393.2467 1400.9199 1401.3243 1402.9222 1419.6275 1456.8951 1462.8481 1464.7453 1466.7459 1469.2158 1470.2979 1473.3274 1479.9989 1553.7047 1598.3057 1609.3854 1649.3627 2981.7542 2983.1109 2987.7591 2989.7300 3060.0129 3061.8946 3062.6790 3069.7690 3089.6446 3092.7489 3110.2992 3122.3485 3131.1200 3506.2519
redmass: 11.6437 7.8768 4.7374 5.3689 3.0467 1.1765 4.2386 1.4329 1.2276 1.5683 1.1117 5.5375 4.5888 3.6474 5.2067 5.8353 4.5778 4.1177 2.8187 3.2858 3.3903 5.4333 4.9146 4.5701 3.9357 3.1512 5.3133 5.0295 4.0831 3.8593 1.4680 4.5797 4.9047 6.2504 4.2702 3.9644 5.3551 1.3084 2.5838 3.7174 2.6054 1.6583 1.9264 1.5582 1.4946 1.5415 1.6274 1.7688 1.8124 2.7710 2.9557 1.7075 6.5672 3.5498 7.0667 4.9174 1.2157 1.2123 1.2443 1.2171 2.3780 1.0572 1.0451 1.0517 1.0530 1.0719 1.0841 1.1991 1.2298 6.3872 6.5637 8.8721 7.9808 1.0372 1.0371 1.0384 1.0381 1.0970 1.0970 1.0971 1.0963 1.0994 1.0996 1.0980 1.0995 1.0914 1.0639
irintensity: 2.4749 0.3305 0.0641 0.4805 0.0090 1.1527 0.3726 1.0572 0.1573 0.0171 1.1695 1.2362 0.8745 2.8055 1.0904 2.3714 4.0970 2.7690 1.2471 2.7728 0.9547 2.4748 0.2313 12.8530 56.0560 1.1417 4.5966 15.0479 2.5236 26.4070 72.4797 13.7926 29.6884 26.9501 8.4021 9.0044 39.1550 7.4910 1.0884 72.5541 63.6769 24.5698 1.8122 17.2183 1.8310 7.4766 7.0123 107.2818 99.4061 24.6245 73.0441 9.9584 14.4203 80.3437 0.5363 23.5169 19.0950 23.0865 14.3338 3.1606 8.0416 5.2545 11.5536 11.9501 7.1005 4.5789 7.9090 31.5631 28.3723 4.3883 15.1719 184.6857 225.6622 24.4400 20.4924 9.1370 11.2342 10.1824 13.9699 6.5014 8.3172 18.7009 20.3827 12.8888 9.7977 15.8579 34.6062
temp: 298.150 k
press: 1.00000 atm
elementType: 35 17 8 8 6 6 6 6 6 6 6 6 6 6 6 6 6 1 1 1 1 1 1 1 1 1 1 1 1 1 1
symmnumber: 1
zpe: 613899.3 jmol-1
zpe.correction: 0.233822 hartree
zpe.thermalcorrener: 0.253182 hartree
zpe.thermalcorrenthalpy: 0.254126 hartree
zpe.thermalcorrgfe: 0.183425 hartree
zpe.sumelectzpe: -1126.500193 hartree
zpe.sumelectthermal: -1126.480832 hartree
zpe.sumelectthermalent: -1126.479888 hartree
zpe.sumelectthermalfe: -1126.550590 hartree
dipole: -0.9173 1.2341 -0.4553
dipole: 1.6037
quadrupole: -120.4570 -106.5832 -120.8919
quadrupole: -8.3232 5.6488 0.1769
quadrupole: -4.4796 9.3942 -4.9146 -8.3232 5.6488 0.1769
hfenergy: -1126.7340146 hartree
pointgroup: C01 [X(C13H14Br1Cl1O2)]
dipole: -0.4420191 -0.4001037 0.2064336 debye
polarizability: 241.8631663|-15.8829223|171.3123276|-1.7510391|-3.6668664|130.9206433 unknown
InChI: InChI=1S/C13H14BrClO2/c1-6-5-7(2)11(14)8(3)10(6)12(15)9(4)13(16)17/h5,16H,1-4H3
charge 0 multiplicity 1
31 atoms
Br -3.681504 2.367069 0.182536
Cl 1.625317 0.025175 -2.217324
O  4.011539 0.953714 -0.74793
O  4.470562 -0.266678 1.164952
C  -0.267127 -0.145019 -0.209297
C  -1.106381 1.009281 -0.130558
C  -0.811637 -1.461114 -0.1179
C  -3.07999 -0.493336 0.168552
C  -2.494481 0.791711 0.062074
C  -2.202815 -1.603119 0.072145
C  1.199203 0.020192 -0.420846
C  -0.532328 2.405845 -0.258498
C  0.074959 -2.687927 -0.224824
C  -4.564828 -0.709972 0.368904
C  2.146668 0.089077 0.561051
C  1.757411 -0.023173 2.028551
C  3.624138 0.206251 0.364732
H  -2.629268 -2.610161 0.146473
H  -0.988044 2.939606 -1.112417
H  -0.749964 3.007938 0.642947
H  0.557429 2.383716 -0.409271
H  0.838424 -2.710689 0.574819
H  -0.519792 -3.613765 -0.153304
H  0.620972 -2.703975 -1.186244
H  -4.919098 -0.230839 1.300238
H  -5.150324 -0.263969 -0.456195
H  -4.801473 -1.785658 0.4201
H  0.681507 -0.215183 2.154532
H  2.013179 0.908494 2.567213
H  2.337213 -0.833962 2.503968
H  5.007034 0.969671 -0.788178
