program: Gaussian 09
title: 000231984
version: EM64L-G09RevD.01
frameworkgroup: C1[X(C8H8N2O4)]
method: RPBEPBE
basis: SDD
operation: Freq
keyword: #pfreq=noraman
keyword: PBEPBE/SDD
title: #p freq=noraman PBEPBE/SDD
converged: YES YES NO YES
title: Mulliken charges:
elementType: O O O O N N C C C C C C C C H H H H H H H H
charge: -0.438428 -0.303153 -0.213588 -0.264107 -0.643404 0.018087 0.534747 0.165379 0.149896 0.285133 -0.465229 -0.585491 -0.805137 0.144893 0.284601 0.294191 0.233764 0.235777 0.235774 0.364824 0.379175 0.392297
chargesum: 0.00000
title: Mulliken charges with hydrogens summed into heavy atoms:
elementType: O O O O N N C C C C C C C C
charge: -0.046131 -0.303153 -0.213588 -0.264107 0.100595 0.018087 0.534747 0.165379 0.149896 0.285133 -0.180628 -0.291300 -0.099823 0.144893
polarizability: 1.79842457e+02 -1.00245129e+00 1.55401300e+02 4.64021798e-03 -1.00966499e-02 5.04061269e+01
1716.lowfreq: -6.7144 -4.7020 -0.0003 0.0007 0.0009 5.9977 26.4421 59.8906 77.2586
frequency: 26.2913 59.8850 77.2487 116.2805 158.6249 189.2577 195.9215 222.4565 325.7067 342.5860 356.0776 399.6009 419.5548 440.0061 452.9412 468.5985 549.3096 576.1878 586.4652 643.9563 663.8327 707.0463 708.2943 757.1494 774.4548 797.6450 801.0212 848.1246 914.0513 945.6358 970.3422 1007.8812 1026.2780 1055.3164 1090.8118 1135.1540 1179.0347 1242.0712 1271.4870 1326.8003 1339.1861 1351.8975 1396.9227 1404.6150 1417.0527 1470.9470 1475.4249 1494.3628 1554.7526 1566.8043 1606.8636 1649.0258 2981.8551 3059.8915 3092.9102 3161.2014 3167.0389 3347.8127 3502.2932 3535.5429
redmass: 1.0528 6.8333 12.1858 8.8726 3.9959 4.5561 6.9139 3.9843 9.9689 4.5098 6.5567 3.7371 6.2991 4.1639 10.1817 5.4261 2.9933 1.2382 4.3441 4.3976 5.9952 5.9681 10.5779 3.5638 1.1461 1.3115 5.1825 5.8790 1.3954 6.8439 1.3720 1.4976 2.8619 1.5417 1.9346 1.7035 5.3071 2.2823 1.6385 4.3177 3.3257 4.1902 2.4242 1.5201 6.0461 1.0447 1.1589 2.3341 2.5939 5.0925 2.8255 7.8334 1.0377 1.0980 1.0987 1.0918 1.0921 1.0455 1.1081 1.0644
irintensity: 0.3629 0.8049 0.0876 0.2212 2.1991 0.8783 1.3322 4.1489 1.7150 1.0965 3.3056 5.3756 0.8068 9.5595 8.3727 5.6086 11.0734 138.9669 29.8171 43.1171 19.6833 0.4648 6.6524 1.3108 161.5996 125.0451 3.5928 0.2927 18.4045 17.6300 0.0259 89.4468 287.1749 14.0302 19.5620 307.2422 249.6760 8.5381 134.3065 77.2533 8.4242 121.9399 34.6779 1.2228 18.0354 15.0397 11.5592 22.8374 361.7333 216.4977 37.4755 202.6597 31.0148 17.2947 10.9374 0.9771 3.9689 99.2270 196.1218 59.2404
temp: 298.150 k
press: 1.00000 atm
elementType: 8 8 8 8 7 7 6 6 6 6 6 6 6 6 1 1 1 1 1 1 1 1
symmnumber: 1
zpe: 415138.8 jmol-1
zpe.correction: 0.158118 hartree
zpe.thermalcorrener: 0.170755 hartree
zpe.thermalcorrenthalpy: 0.171699 hartree
zpe.thermalcorrgfe: 0.118041 hartree
zpe.sumelectzpe: -718.989647 hartree
zpe.sumelectthermal: -718.977010 hartree
zpe.sumelectthermalent: -718.976066 hartree
zpe.sumelectthermalfe: -719.029724 hartree
dipole: 4.5555 2.7973 0.0029
dipole: 5.3458
quadrupole: -88.9635 -75.1915 -81.5391
quadrupole: -3.1010 -0.0120 -0.0051
quadrupole: -7.0654 6.7065 0.3589 -3.1010 -0.0120 -0.0051
hfenergy: -719.1477648 hartree
pointgroup: C01 [X(C8H8N2O4)]
dipole: -1.7996065 -1.0884047 0.0154558 debye
dipolederiv: -1.3311437 -0.3389812 0.0026026 -0.5849473 -0.4292258 -0.00269 0.0073215 -0.0016266 -0.4183352 -0.812491 0.2366256 -0.0071071 0.3234287 -1.0307522 0.0155056 -0.009212 0.0155312 -0.3474775 -1.0818249 0.1250116 -0.006029 0.3163096 -0.4554385 0.0057726 -0.0099873 0.0050583 -0.2336083 -0.4809775 -0.0955052 0.0010653 -0.3932857 -0.884495 0.0107134 0.0072569 0.0119669 -0.2746991 -0.3971194 0.0373484 -0.0000015 0.0933195 -1.1775609 0.0130757 -0.0012432 0.0130159 -0.5492814 2.0143225 0.1943845 0.0035682 0.4014927 1.058953 -0.015886 -0.0007061 -0.0169851 0.1878487 -1.0731348 0.0137013 -0.0048782 0.0276988 0.390188 -0.0095011 -0.0051986 -0.0096431 -0.0677342 0.2024814 0.0101523 0.0000813 -0.0507373 1.0347637 -0.0181854 0.001285 -0.0180227 0.1363274 -0.6919224 -0.0068911 -0.0031538 0.7638329 -0.5378019 0.0138187 -0.0189668 0.0100702 -0.0422318 -0.7844026 0.0382839 -0.0041195 -0.6863862 -0.408167 0.0055007 0.0108122 0.0088547 0.0131747 0.5496059 0.0369959 0.0021146 -0.8255731 0.1555492 -0.0084678 0.0201965 -0.0044223 -0.0735545 0.355544 -0.0310381 0.0027181 0.8176077 0.1268387 -0.0006637 -0.0147983 -0.0044708 -0.0858608 0.0518082 -0.0756892 0.0015164 -0.0445294 -0.1066904 0.0034183 0.0008122 0.0033612 0.0654401 2.2657412 -0.1974838 0.0139818 -0.2168326 1.2265495 -0.0213768 0.0148428 -0.0215768 0.2366918 0.0644284 -0.0684421 0.0010401 -0.0735059 0.0880031 0.0007616 0.0011324 0.0008116 0.1423144 0.08176 0.0735414 -0.0018868 0.0208183 0.1044498 0.0011719 -0.0008232 0.0013778 0.155306 -0.0929829 0.1258274 -0.0035581 -0.0020676 0.0448205 0.0014307 -0.0009063 0.0019941 0.1136388 0.0703514 -0.0455438 0.1030666 -0.0156856 -0.0129326 0.0383773 0.0767666 0.1038281 -0.0382091 0.071915 -0.0488858 -0.1001386 -0.018558 -0.0189043 -0.0393988 -0.0750985 -0.1051214 -0.0337381 0.2480846 -0.0448692 0.0003689 0.0347707 0.3274846 0.0008251 -0.001312 0.0004502 0.3591632 0.3994525 -0.0044614 0.0003241 -0.0392447 0.3264979 0.0003798 0.0012155 0.0005545 0.353725 0.3705042 0.0659184 -0.0015753 0.1520745 0.1778706 0.0054182 -0.0033894 0.0049941 0.4010996 unknown
polarizability: 179.8252302|-1.1537343|155.3708219|0.6140615|-2.1736813|50.4538314 unknown
InChI: InChI=1S/C8H8N2O4/c1-4-2-5(8(11)12)7(9)6(3-4)10(13)14/h2-3,11H,9H2,1H3
charge 0 multiplicity 1
22 atoms
O  -3.61639 -0.10874 -0.034109
O  -2.691851 2.009183 -0.073301
O  3.614051 -0.017954 -0.003154
O  2.613582 2.025691 -0.048792
N  -0.01374 2.194801 -0.06326
N  2.549519 0.715903 -0.022464
C  0.036678 -2.084498 0.024817
C  0.012924 0.833578 -0.035545
C  -1.217457 0.0559 -0.02544
C  1.240735 0.067393 -0.014447
C  -1.17768 -1.354897 0.003869
C  1.234872 -1.347292 0.014973
C  0.037015 -3.601406 0.056591
C  -2.514415 0.753598 -0.046045
H  -2.133215 -1.888896 0.010213
H  2.206135 -1.850502 0.029868
H  1.063705 -4.003308 0.069612
H  -0.485765 -3.98528 0.952277
H  -0.477887 -4.022717 -0.826745
H  0.889485 2.682992 -0.068768
H  -0.932981 2.656288 -0.076845
H  -4.445817 0.439766 -0.050003
