program: Gaussian 09
title: 000231974
version: EM64L-G09RevD.01
frameworkgroup: C1[X(C6H12O3)]
method: RPBEPBE
basis: SDD
operation: Freq
keyword: #pfreq=noraman
keyword: PBEPBE/SDD
title: #p freq=noraman PBEPBE/SDD
converged: YES YES NO NO
title: Mulliken charges:
elementType: O O O C C C C C C H H H H H H H H H H H H
charge: -0.250820 -0.249175 -0.439132 0.077630 -0.379523 -0.479730 -0.310023 -0.316602 -0.343094 0.201956 0.232620 0.200108 0.217992 0.230277 0.187242 0.231745 0.232002 0.183775 0.242260 0.199289 0.331205
chargesum: 0.00000
title: Mulliken charges with hydrogens summed into heavy atoms:
elementType: O O O C C C C C C
charge: -0.250820 -0.249175 -0.107928 0.279586 0.053205 -0.031461 0.108964 0.099174 0.098455
polarizability: 8.53725367e+01 2.16350496e+00 6.96327150e+01 2.48300602e+00 -6.87681257e-01 6.36405797e+01
1716.lowfreq: -28.1880 -14.4408 0.0006 0.0012 0.0013 11.3525 55.9894 83.4193 161.9969
frequency: 55.6046 83.3866 161.9939 188.0574 247.3984 318.4837 325.8048 341.7307 429.0342 447.1654 503.7628 518.2678 598.9627 760.8295 836.3305 854.4222 872.2064 885.1182 904.9546 922.9420 976.4365 1006.9445 1045.2833 1055.7044 1061.7027 1113.7622 1130.6679 1161.0879 1196.2968 1215.0409 1238.9675 1266.4865 1319.2401 1323.1706 1327.6917 1342.9289 1362.4913 1363.3995 1374.8315 1396.1506 1438.0101 1441.4267 1457.6703 1471.6741 1476.0491 2911.8914 2935.9242 2942.4694 2972.6234 2998.9458 3005.9697 3066.8904 3069.3587 3086.3044 3091.6402 3101.4368 3556.2861
redmass: 4.0802 4.3270 2.5295 3.2021 2.8509 2.5597 1.4244 1.4024 3.0016 4.8035 3.1879 2.5111 2.4637 2.5783 3.4199 2.5595 2.9386 1.7879 2.7052 2.5351 2.5520 1.8659 2.3991 2.9507 2.7570 2.2857 1.3934 1.5785 1.2172 1.3439 1.2978 1.1561 1.2685 1.2664 1.1840 1.4073 1.2181 1.2613 1.2845 1.6048 1.0946 1.0895 1.0857 1.0979 1.0789 1.0835 1.0691 1.0689 1.0688 1.0615 1.0614 1.1005 1.0995 1.0945 1.0980 1.0961 1.0661
irintensity: 1.0191 7.5098 4.4919 10.4796 2.2408 4.5833 104.8316 68.1711 2.7865 10.7821 31.1310 6.7117 2.6556 18.4267 17.3277 25.3300 8.0482 26.6336 12.4025 29.6920 25.5207 117.3381 13.1978 89.6176 39.2660 56.6221 5.9185 13.6629 1.5046 22.8531 2.0785 12.9208 1.8814 11.2304 5.4340 3.1645 9.6506 7.8152 11.4145 19.2433 12.2554 16.0819 6.3959 10.7186 8.8669 36.3514 34.4779 111.3061 77.8551 34.5868 23.6069 17.2838 32.9078 40.0847 35.0078 20.0240 3.9729
temp: 298.150 k
press: 1.00000 atm
elementType: 8 8 8 6 6 6 6 6 6 1 1 1 1 1 1 1 1 1 1 1 1
symmnumber: 1
zpe: 469889.0 jmol-1
zpe.correction: 0.178971 hartree
zpe.thermalcorrener: 0.188221 hartree
zpe.thermalcorrenthalpy: 0.189165 hartree
zpe.thermalcorrgfe: 0.144478 hartree
zpe.sumelectzpe: -460.727160 hartree
zpe.sumelectthermal: -460.717910 hartree
zpe.sumelectthermalent: -460.716966 hartree
zpe.sumelectthermalfe: -460.761653 hartree
dipole: 1.4874 -0.7866 0.5343
dipole: 1.7654
quadrupole: -47.1560 -56.0810 -56.0840
quadrupole: 7.1890 5.8478 -2.2719
quadrupole: 5.9510 -2.9740 -2.9770 7.1890 5.8478 -2.2719
hfenergy: -460.9061311 hartree
pointgroup: C01 [X(C6H12O3)]
dipole: 0.5743384 -0.3793564 0.092842 debye
dipolederiv: -0.8890562 -0.2364546 -0.0656844 -0.1727472 -0.7454416 -0.10164 -0.0276564 -0.0269455 -0.4271267 -0.9852093 0.2162451 -0.0131762 0.1472046 -0.6735252 0.0248215 0.0161901 -0.0284344 -0.4052301 -0.6959419 0.1405108 0.1820218 0.1573818 -0.2430773 0.1868565 0.2435197 0.1495624 -0.6746833 0.9174888 -0.0165198 -0.0735209 0.0022159 0.9959374 0.0352888 -0.1841488 0.0118785 0.493112 -0.0961574 0.0051133 0.020486 0.0069206 -0.1422054 -0.0237989 0.0060325 -0.0243216 0.0737895 -0.2075325 0.0565862 0.0286723 0.1167366 0.0192055 -0.0758732 0.0146224 -0.0179914 -0.0215886 0.6172813 0.1184239 0.0801796 0.0004073 0.2660883 0.0223007 0.117765 0.1065619 0.4163419 0.6120861 -0.0613421 0.0673915 0.0677098 0.2819651 -0.0398984 0.1479203 -0.1124956 0.383447 0.4821972 -0.0134563 -0.1272293 -0.0681802 0.2802494 -0.1223781 -0.168786 -0.1289852 0.5715073 0.0224192 0.0100911 -0.0470937 -0.0175854 -0.0566039 0.0103542 0.0607326 0.0335965 -0.1993956 0.0915318 0.0031772 0.0269623 -0.0030277 0.0325645 0.0236644 0.0860601 0.030006 -0.1252712 -0.1613407 -0.0177383 -0.0972897 -0.0152346 0.0843832 -0.0065478 -0.125388 -0.0097667 0.0393347 0.0171005 -0.0698418 0.0027349 -0.0749901 -0.1177351 -0.0165987 -0.0001167 0.0190607 0.1029409 0.0679297 -0.0024515 0.0611834 0.0224596 0.0865964 0.070624 0.0184383 0.0478205 -0.1003199 -0.0329146 -0.0096911 0.0397581 0.0275653 0.0687163 0.0671157 -0.0328728 -0.0432242 -0.220413 0.0083508 -0.0666157 -0.008352 -0.0750492 -0.1384087 0.0124249 0.0058143 0.0496805 0.0797292 -0.038767 0.0966619 0.0222793 0.0940296 -0.0713358 -0.0530744 0.0426776 -0.0852062 0.05573 -0.0253197 -0.0214159 0.0441516 -0.0410481 0.0480608 0.0119911 -0.0618889 0.1046145 -0.2166908 0.1185246 -0.0751827 0.0174171 -0.042346 -0.080915 0.0021396 0.0103853 -0.0307138 0.0370808 -0.2006772 0.0433666 -0.1183743 0.0086328 0.0704914 0.0112348 -0.0975681 0.0504265 -0.10622 0.3780063 -0.0994662 -0.0425172 -0.1410552 0.0349897 -0.0390067 -0.0717326 -0.0951235 0.2439262 unknown
polarizability: 85.8357939|0.7266026|69.5212968|1.0371336|0.3743278|63.2887406 unknown
InChI: InChI=1S/C6H12O3/c7-3-2-6-8-4-1-5-9-6/h6-7H,1-5H2
charge 0 multiplicity 1
21 atoms
O  0.397284 1.18552 -0.201433
O  0.699242 -1.203006 -0.478778
O  -2.884552 0.186098 1.396973
C  -0.161955 -0.145657 0.055626
C  2.676428 0.235374 -0.050986
C  -1.506999 -0.223804 -0.653397
C  1.711897 1.323855 0.460747
C  2.031247 -1.148392 0.164272
C  -2.571894 0.650372 0.030723
H  -0.255031 -0.280643 1.160571
H  2.86414 0.38927 -1.128654
H  3.644172 0.294543 0.484722
H  -1.828095 -1.282691 -0.680263
H  -1.359931 0.108997 -1.697803
H  1.579322 1.23829 1.562839
H  2.05957 2.340203 0.217626
H  2.615022 -1.959121 -0.299219
H  1.920263 -1.35554 1.252811
H  -2.193242 1.675392 0.167104
H  -3.491137 0.686429 -0.590032
H  -3.273052 -0.723689 1.339152
