program: Gaussian 09
title: 000231997
version: EM64L-G09RevD.01
frameworkgroup: C1[X(C13H14N2O3S)]
method: RPBEPBE
basis: SDD
operation: Freq
keyword: #p
keyword: freq=noraman
keyword: PBEPBE/SDD
title: #p freq=noraman PBEPBE/SDD
converged: YES YES NO NO
title: Mulliken charges:
elementType: S O O O N N C C C C C C C C C C C C C H H H H H H H H H H H H H H
charge: 0.845950 -0.563218 -0.549624 -0.257250 -0.441227 -0.665325 0.044510 -0.123820 0.442774 -0.236688 -0.536006 -0.240368 -0.230002 0.381531 -0.347514 -0.207266 -0.219434 -0.222456 -0.536808 0.269422 0.232449 0.253508 0.287183 0.282827 0.244970 0.237470 0.235434 0.233227 0.363062 0.311767 0.226759 0.233865 0.250299
chargesum: 0.00000
title: Mulliken charges with hydrogens summed into heavy atoms:
elementType: S O O O N N C C C C C C C C C C C C C
charge: 0.845950 -0.563218 -0.549624 -0.257250 -0.171805 0.009504 0.044510 -0.123820 0.442774 -0.004239 -0.282499 0.046815 0.052825 0.381531 -0.102544 0.030205 0.016000 0.010771 0.174115
polarizability: 4.09787313e+02 -1.48303334e+01 1.98679235e+02 -5.07501606e+00 3.63564140e+00 1.23854923e+02
1716.lowfreq: -3.8157 -0.0021 -0.0012 0.0014 4.0385 6.7695 13.7798 17.4273 36.7775
frequency: 13.3435 17.3820 36.7090 48.6429 65.4909 83.5001 102.4127 114.5550 146.7469 150.8960 202.7174 218.0044 220.3419 237.5443 244.5310 321.8025 332.9677 354.7296 375.8728 385.9679 395.8307 404.3442 433.2757 453.4803 493.3763 499.7386 541.7399 570.3450 603.5043 624.9955 649.7789 655.5963 695.4854 703.6720 745.0839 757.0909 763.5821 773.3337 797.6801 851.8529 855.0821 870.9210 897.4449 919.4836 932.1544 935.6911 977.6252 980.9281 982.4601 1000.9307 1007.5368 1045.1026 1054.9737 1072.1836 1085.0290 1110.3779 1148.4417 1163.8033 1169.9080 1174.1850 1205.3615 1289.4967 1298.5580 1308.0235 1323.2215 1382.6329 1428.2773 1432.1195 1438.1472 1450.4596 1468.8760 1471.0146 1481.5720 1501.6369 1538.7064 1577.4220 1594.4898 1599.9355 1635.6046 2974.0137 3069.0604 3130.5550 3133.9700 3135.4959 3140.7113 3150.6813 3158.9855 3159.6540 3169.5775 3178.6170 3343.3149 3492.0970 3672.2146
redmass: 5.2091 5.9371 4.9694 5.3484 5.3745 4.1773 9.2681 4.8941 6.3828 6.6468 2.0521 2.8431 3.6085 6.0258 2.4256 5.6110 3.4587 8.1001 5.5085 4.3498 8.5267 2.8348 4.3720 1.5651 2.0530 3.6935 5.0629 3.9127 6.4420 3.1086 4.5186 1.3113 2.3639 6.0990 2.1356 1.4684 7.1949 4.2214 2.1088 1.3053 1.6861 3.2228 1.6913 5.2488 1.3545 1.3648 5.8977 3.0784 1.3913 1.3365 4.3903 2.0562 1.5035 1.5365 1.6461 1.2557 1.3894 1.2647 1.0563 1.1246 2.0778 1.4862 1.3094 2.8039 3.4066 8.8907 3.7403 2.2136 1.4129 2.0461 1.0922 1.0697 2.4594 3.9202 5.9850 5.6325 1.3855 6.8798 4.9323 1.0322 1.1046 1.0852 1.0979 1.0922 1.0882 1.0925 1.0964 1.0922 1.1014 1.0943 1.0762 1.0483 1.1003
irintensity: 1.2614 0.9000 0.4883 1.1755 3.2070 1.6001 24.1339 18.8899 4.6061 2.3670 14.2412 0.7922 7.8058 12.9775 6.6241 4.5088 5.3344 23.4890 9.2687 8.9180 72.6174 1.8358 7.0020 119.1076 5.0892 74.1067 38.4303 2.0629 0.0087 1.5994 5.5931 91.1846 14.1489 6.5881 14.5153 69.5019 61.3389 23.0413 21.8754 6.6132 30.9656 110.8275 29.1910 3.0335 2.2233 3.4216 19.6502 45.6489 0.3815 1.5321 6.4962 19.1868 5.6959 8.3194 23.5541 0.1550 6.8963 197.9710 0.0130 14.8811 174.9195 13.4563 6.3130 245.4470 177.0870 3.1401 11.1367 13.4575 10.3829 21.2536 69.6528 33.2419 29.2173 58.1791 172.7218 17.3348 97.5959 0.9479 517.3584 92.3638 35.7559 0.4275 23.8639 2.9613 10.9201 1.6255 6.5770 5.6727 51.2829 11.5580 10.9321 49.1175 47.3500
temp: 298.150 k
press: 1.00000 atm
elementType: 16 8 8 8 7 7 6 6 6 6 6 6 6 6 6 6 6 6 6 1 1 1 1 1 1 1 1 1 1 1 1 1 1
symmnumber: 1
zpe: 650808.7 jmol-1
zpe.correction: 0.247880 hartree
zpe.thermalcorrener: 0.267086 hartree
zpe.thermalcorrenthalpy: 0.268030 hartree
zpe.thermalcorrgfe: 0.197391 hartree
zpe.sumelectzpe: -1235.463472 hartree
zpe.sumelectthermal: -1235.444266 hartree
zpe.sumelectthermalent: -1235.443322 hartree
zpe.sumelectthermalfe: -1235.513961 hartree
dipole: 3.1234 -4.4044 2.5715
dipole: 5.9806
quadrupole: -80.7296 -114.3901 -125.8106
quadrupole: 17.3215 -9.2074 4.8258
quadrupole: 26.2471 -7.4133 -18.8339 17.3215 -9.2074 4.8258
hfenergy: -1235.711352 hartree
pointgroup: C01 [X(C13H14N2O3S1)]
dipole: 1.5426613 -1.2021954 1.3081367 debye
polarizability: 407.389533|25.1897133|198.5629165|-10.7697383|-14.0238445|126.3690211 unknown
InChI: InChI=1S/C7H9N2O.C6H5O2S/c1-10-5-2-3-6(8)7(9)4-5;7-9(8)6-4-2-1-3-5-6/h2-4,8H,9H2,1H3;1-5H
charge 0 multiplicity 1
33 atoms
S  -1.503725 0.843654 -0.608051
O  -2.451756 2.166955 -0.894575
O  -0.491966 0.262686 -1.778798
O  5.06014 -0.32358 -0.534676
N  -0.039279 1.183333 1.237956
N  0.839475 -1.343974 1.539565
C  1.218217 0.914644 0.75341
C  -2.714353 -0.574561 -0.235531
C  1.69334 -0.459834 0.929182
C  2.085069 1.846377 0.088828
C  2.987061 -0.819551 0.486194
C  -3.994727 -0.243155 0.237527
C  -2.287327 -1.894151 -0.461692
C  3.808476 0.141634 -0.135901
C  3.364744 1.491058 -0.335386
C  -4.893453 -1.302049 0.509202
C  -3.199914 -2.939847 -0.188123
C  -4.495009 -2.643781 0.301478
C  5.961776 0.60133 -1.235563
H  -0.27236 2.197185 1.209918
H  1.715131 2.864253 -0.083678
H  3.370001 -1.837043 0.609952
H  -4.280356 0.807021 0.358238
H  -1.287929 -2.085339 -0.867512
H  4.003245 2.226806 -0.830118
H  -5.901085 -1.077402 0.875137
H  -2.903914 -3.979333 -0.367048
H  -5.197288 -3.458476 0.510118
H  -0.05594 -0.974779 1.868394
H  1.095921 -2.312139 1.710716
H  6.232758 1.459581 -0.592487
H  5.507571 0.961978 -2.177032
H  6.858558 0.0058 -1.458244
