program: Gaussian 09
title: 000232018
version: EM64L-G09RevD.01
frameworkgroup: C1[X(C25H28O3)]
method: RPBEPBE
basis: SDD
operation: Freq
keyword: #pfreq=noraman
keyword: PBEPBE/SDD
title: #p freq=noraman PBEPBE/SDD
converged: YES YES NO NO
title: Mulliken charges:
elementType: O O O C C C C C C C C C C C C C C C C C C C C C C C C C H H H H H H H H H H H H H H H H H H H H H H H H H H H H
charge: -0.416137 -0.416681 -0.446249 -0.065490 0.178884 0.200035 -0.081452 0.199748 0.358955 0.176497 0.210712 0.344581 0.095215 0.403020 -0.523140 -0.697472 0.097325 -0.521385 0.188618 -0.823742 -0.672251 -0.843677 0.144462 -0.843162 -0.821419 -0.850126 -0.842475 -0.818833 0.266425 0.238149 0.266451 0.230475 0.258518 0.221906 0.225381 0.226885 0.250253 0.245391 0.248000 0.229923 0.232155 0.224182 0.233085 0.257394 0.234073 0.231331 0.230475 0.253838 0.223848 0.247854 0.221557 0.274852 0.224398 0.366252 0.365395 0.357190
chargesum: 0.00000
title: Mulliken charges with hydrogens summed into heavy atoms:
elementType: O O O C C C C C C C C C C C C C C C C C C C C C C C C C
charge: -0.049885 -0.051286 -0.089058 -0.065490 0.178884 0.200035 -0.081452 0.199748 0.358955 0.176497 0.210712 0.344581 0.095215 0.403020 -0.256715 -0.459323 0.097325 -0.254934 0.188618 -0.112842 -0.446870 -0.121147 0.144462 -0.133085 -0.106757 -0.154246 -0.116936 -0.098026
polarizability: 4.33541955e+02 -1.27170587e+00 2.73356842e+02 1.24872136e+00 -1.35654922e+00 1.82788812e+02
1716.lowfreq: -1.1910 -0.0008 -0.0006 0.0013 6.9966 9.6285 16.5381 26.2260 32.7125
frequency: 16.4965 26.2188 32.6443 34.1913 54.8334 78.4911 88.6723 91.4999 110.9063 116.2904 129.5540 131.6694 132.2224 136.6009 141.8563 145.0335 155.1768 167.3734 182.4290 206.5123 210.2332 241.2152 250.4247 281.5017 291.3229 298.1194 305.8426 309.7183 325.1196 329.1372 332.8222 348.1640 354.0418 376.6391 398.3873 414.1193 437.2853 449.2161 455.5272 459.4692 464.6578 476.9361 480.1211 526.3903 537.3990 540.6782 545.7603 553.0584 558.7839 564.4191 584.9434 606.6518 621.8534 653.2382 692.9924 695.6503 735.7960 744.4182 756.5588 766.2486 773.2120 796.7176 833.1103 878.6182 882.4188 889.0532 892.0107 922.9402 937.4230 987.5414 996.3089 1003.7312 1014.0451 1015.8852 1022.3895 1034.6709 1035.1275 1039.3209 1044.0914 1048.3002 1052.3864 1054.6885 1059.6794 1081.9865 1095.7649 1120.0418 1158.8038 1163.0052 1165.6933 1180.0377 1208.3238 1239.9825 1240.3142 1254.0458 1260.8803 1308.9838 1314.0638 1338.0492 1349.5814 1354.0011 1363.0762 1391.6193 1394.8462 1397.4536 1398.4106 1402.3002 1403.8545 1406.2793 1407.5054 1410.5031 1437.4029 1454.1158 1459.1224 1462.0544 1463.3306 1464.6975 1466.2930 1469.3503 1472.8008 1474.4472 1476.7263 1480.7060 1482.0609 1486.2089 1488.9135 1490.9479 1493.8064 1504.9157 1560.3519 1573.6041 1601.5490 1602.4610 1607.9630 1646.3328 2971.0228 2972.6885 2973.2318 2974.2531 2976.0116 2976.2253 2977.8691 3038.0168 3042.8135 3043.0911 3047.4226 3048.8995 3054.1249 3057.2581 3080.8102 3083.4882 3083.9415 3103.6582 3104.1951 3105.4782 3106.7803 3116.1680 3117.4205 3156.1498 3158.9116 3489.6799 3493.4146 3584.2749
redmass: 3.5123 4.7527 5.4679 4.8431 4.5762 3.7186 1.0470 1.0736 2.5711 2.4229 1.2044 4.7879 1.2534 1.8669 1.6232 3.4392 1.4632 1.5790 1.5598 3.3584 1.6331 4.9521 5.2276 4.0946 2.9190 2.7581 3.0357 3.1074 3.6705 2.7542 2.6809 2.5708 1.2084 3.9282 4.8963 5.3211 5.9154 5.5812 4.6368 6.2749 2.6156 1.1617 1.1677 3.7703 3.0007 3.0350 3.2035 4.8354 4.4557 4.4688 3.6682 5.0776 4.4110 4.0212 6.2015 6.3967 3.8919 3.8274 3.9163 4.4753 3.7009 3.7204 1.4848 1.3056 1.5358 3.1790 1.5148 2.4739 2.8480 2.4626 1.5948 1.4934 1.4357 1.6603 1.4169 1.7165 1.7230 1.5415 1.5350 1.5399 1.5774 1.6894 2.2316 2.0398 3.2991 2.2033 1.5966 1.8486 2.6406 1.4083 2.4689 1.7327 1.6161 1.4809 2.9022 4.6554 6.7524 4.5590 6.0180 6.8391 5.5716 1.7920 1.3211 1.6401 1.3466 1.2249 1.2318 1.2190 1.4035 2.8336 1.8397 2.1359 1.1963 1.1149 1.1829 1.0696 1.2411 1.4246 1.1731 1.1146 1.0656 1.3773 1.1725 1.2930 1.2726 1.1170 1.0653 3.8991 7.7671 6.1408 5.9883 6.9926 6.4082 7.0460 1.0400 1.0413 1.0378 1.0399 1.0376 1.0405 1.0375 1.0958 1.0962 1.0958 1.0961 1.0973 1.0965 1.0966 1.0982 1.0996 1.0998 1.0958 1.0911 1.0952 1.0965 1.0961 1.0911 1.0919 1.0925 1.0646 1.0648 1.0659
irintensity: 0.0247 0.3289 0.0089 0.3107 0.0115 0.0752 0.0278 0.5886 1.5959 0.2452 0.4808 0.8968 0.0890 1.3423 0.0812 0.0193 0.4995 0.7410 3.5767 2.4916 0.1063 4.6378 0.0768 0.0289 19.3891 1.1641 5.3353 0.6978 11.9011 5.2511 2.0631 0.0800 98.2100 7.2224 19.5813 7.5178 0.3600 0.3335 4.7019 1.1165 33.8195 18.3176 110.3082 1.5484 3.2976 1.5458 1.8307 0.1275 0.5521 1.1149 3.3637 18.2016 2.0920 0.3889 0.9057 1.7001 19.9290 2.2056 5.6138 24.2122 2.6438 49.5954 24.1363 8.8067 0.4354 4.3247 26.8864 3.4593 1.9035 5.0780 7.6400 20.0050 10.3579 22.8546 5.7683 0.2381 9.7097 0.0231 6.0332 8.0084 1.6694 1.3697 238.0022 7.1667 0.7108 40.9142 3.2990 154.5465 56.9865 56.4845 1.3799 41.9124 38.5920 1.8960 60.6357 3.2723 71.6871 8.8757 10.5316 131.5826 5.1787 6.0542 5.0040 14.6832 2.7692 9.6494 25.5416 18.3163 13.4359 12.8474 6.7459 27.1928 10.6791 25.5629 25.5864 3.4225 5.6770 25.1165 11.0782 10.3255 14.9155 34.3668 115.6061 13.6439 38.0815 20.3002 6.6640 34.4679 0.0238 4.0100 67.0926 11.1341 10.3048 0.0333 56.6594 14.2379 43.8534 45.4795 20.0498 12.5415 19.3087 34.1524 34.9588 2.0383 1.9194 18.9508 12.2781 10.8284 19.7300 42.7964 17.0135 38.9491 24.0113 1.1488 14.9369 6.5553 26.9860 4.2671 0.0038 141.4265 47.5676 41.9451
temp: 298.150 k
press: 1.00000 atm
elementType: 8 8 8 6 6 6 6 6 6 6 6 6 6 6 6 6 6 6 6 6 6 6 6 6 6 6 6 6 1 1 1 1 1 1 1 1 1 1 1 1 1 1 1 1 1 1 1 1 1 1 1 1 1 1 1 1
symmnumber: 1
zpe: 1203647.0 jmol-1
zpe.correction: 0.458445 hartree
zpe.thermalcorrener: 0.488025 hartree
zpe.thermalcorrenthalpy: 0.488969 hartree
zpe.thermalcorrgfe: 0.398180 hartree
zpe.sumelectzpe: -1193.129631 hartree
zpe.sumelectthermal: -1193.100051 hartree
zpe.sumelectthermalent: -1193.099107 hartree
zpe.sumelectthermalfe: -1193.189897 hartree
dipole: -0.7846 1.4798 -0.1710
dipole: 1.6837
quadrupole: -137.7623 -152.5849 -177.3413
quadrupole: 7.9066 -0.1478 -3.8239
quadrupole: 18.1339 3.3113 -21.4452 7.9066 -0.1478 -3.8239
hfenergy: -1193.5880763 hartree
pointgroup: C01 [X(C25H28O3)]
dipole: 0.3001865 0.5904786 -0.00042 debye
polarizability: 433.4638776|3.7470319|272.521475|1.5622433|-9.1105717|183.702257 unknown
InChI: InChI=1S/C25H28O3/c1-12-8-13(2)24(17(6)15(12)4)19-10-23(28)20(11-22(19)27)25-14(3)9-21(26)16(5)18(25)7/h8-11,26-28H,1-7H3
charge 0 multiplicity 1
56 atoms
O  1.392586 -0.49668 2.373221
O  -1.409118 0.506125 -2.397682
O  -7.163793 0.478531 0.105877
C  2.924924 -0.160863 -0.059781
C  3.745293 1.008324 -0.072551
C  1.423906 -0.058754 -0.056755
C  -2.941101 0.171963 0.037851
C  -1.440253 0.073709 0.032946
C  3.527661 -1.457494 -0.050263
C  5.169628 0.889873 -0.085118
C  -3.75918 -1.001171 0.081065
C  5.770427 -0.401844 -0.07615
C  0.713926 -0.242739 1.163676
C  -3.547329 1.467988 0.013887
C  0.67773 0.189144 -1.231762
C  4.93746 -1.546981 -0.057103
C  -0.729795 0.255149 -1.187655
C  -0.693451 -0.175092 1.207831
C  -5.180847 -0.895858 0.105094
C  3.117256 2.392955 -0.066359
C  -4.955679 1.563786 0.034445
C  2.682374 -2.72086 -0.048483
C  -5.754704 0.399312 0.081903
C  6.019072 2.151494 -0.099927
C  -3.133981 -2.385872 0.09716
C  7.280379 -0.586906 -0.086338
C  -2.703966 2.732098 -0.016904
C  -6.068602 -2.124606 0.153681
H  1.18528 0.327954 -2.191185
H  5.402591 -2.540568 -0.054198
H  -1.200991 -0.315531 2.167051
H  3.309502 2.925831 -1.018526
H  2.026516 2.342776 0.071601
H  3.539255 3.023429 0.738895
H  -5.428698 2.55525 0.021643
H  3.316563 -3.619147 -0.139791
H  2.089005 -2.817563 0.880676
H  1.959565 -2.720495 -0.884665
H  7.090056 1.930908 -0.225843
H  5.71792 2.831329 -0.91913
H  5.906083 2.725086 0.841334
H  -3.57584 -3.033561 -0.68292
H  -3.311686 -2.892546 1.066007
H  -2.045969 -2.342812 -0.062391
H  7.544042 -1.65761 -0.051737
H  7.741157 -0.16058 -0.997909
H  7.763003 -0.096051 0.779803
H  -2.128475 2.817009 -0.958117
H  -3.33427 3.632887 0.077059
H  -1.965808 2.738228 0.805358
H  -5.806905 -2.776281 1.008414
H  -7.126533 -1.837709 0.245648
H  -5.957877 -2.737891 -0.76166
H  2.371774 -0.472277 2.201057
H  -2.388008 0.460317 -2.227271
H  -7.457276 1.422988 0.098292
