program: Gaussian 09
title: 000231971
version: EM64L-G09RevD.01
frameworkgroup: C1[X(C5H10O3)]
method: RPBEPBE
basis: SDD
operation: Freq
keyword: #pfreq=noraman
keyword: PBEPBE/SDD
title: #p freq=noraman PBEPBE/SDD
converged: YES YES NO NO
title: Mulliken charges:
elementType: O O O C C C C C H H H H H H H H H H
charge: -0.278747 -0.275143 -0.436769 0.028701 -0.414698 -0.308961 -0.307596 -0.308356 0.211396 0.206654 0.237319 0.230616 0.214312 0.234893 0.212220 0.178730 0.245157 0.330272
chargesum: 0.00000
title: Mulliken charges with hydrogens summed into heavy atoms:
elementType: O O O C C C C C
charge: -0.278747 -0.275143 -0.106497 0.240097 0.029275 0.135967 0.139517 0.115531
polarizability: 7.72046466e+01 3.32630376e+00 5.72123371e+01 -1.89184585e+00 -5.04924852e-01 5.27489062e+01
1716.lowfreq: -19.3310 0.0004 0.0010 0.0012 7.5461 11.8786 33.5896 86.3500 100.1752
frequency: 30.7250 86.3358 100.1676 154.1942 252.8256 304.2847 338.3805 377.7682 505.0172 610.8644 665.8883 751.9322 831.7340 857.3594 878.2191 925.3473 967.9563 974.6165 997.0753 1052.7088 1073.6970 1096.4668 1118.4454 1152.8433 1161.5794 1195.6186 1245.3015 1268.8305 1285.7231 1323.3211 1324.4147 1340.4532 1364.5713 1386.1628 1450.2967 1469.0185 1474.2106 1483.2905 2947.0195 2974.2256 2987.6221 2989.7094 2994.8002 3067.8422 3094.9151 3099.2362 3104.9015 3557.0443
redmass: 3.5465 3.3581 2.2183 3.4853 2.2659 1.6872 2.0853 3.7883 3.0014 2.3338 6.3434 2.2097 1.5947 2.3140 5.3029 2.7539 3.2701 3.0657 3.2913 3.1792 2.1543 1.8986 2.2678 1.3064 1.1802 1.2624 1.1956 1.2467 1.1638 1.2649 1.2413 1.2595 1.4046 1.2871 1.0860 1.0910 1.0965 1.0803 1.0709 1.0857 1.0699 1.0633 1.0617 1.0958 1.0989 1.0960 1.1032 1.0662
irintensity: 12.3965 5.5381 4.0168 4.8926 1.5235 78.9770 85.7184 22.1476 17.6483 4.1287 3.8501 17.8724 31.6220 2.2622 12.1758 46.7010 104.4978 28.1776 34.0904 3.2491 93.8162 9.3305 37.6297 31.9439 5.9402 12.0013 2.0747 17.5550 5.6808 2.9640 3.5188 11.1758 20.0639 27.4865 9.7255 6.8542 1.6073 4.7071 55.0879 80.6196 50.6396 20.1692 69.9700 21.5843 25.8527 24.5205 34.0951 5.7726
temp: 298.150 k
press: 1.00000 atm
elementType: 8 8 8 6 6 6 6 6 1 1 1 1 1 1 1 1 1 1
symmnumber: 1
zpe: 392943.1 jmol-1
zpe.correction: 0.149664 hartree
zpe.thermalcorrener: 0.158333 hartree
zpe.thermalcorrenthalpy: 0.159277 hartree
zpe.thermalcorrgfe: 0.115070 hartree
zpe.sumelectzpe: -421.494831 hartree
zpe.sumelectthermal: -421.486162 hartree
zpe.sumelectthermalent: -421.485217 hartree
zpe.sumelectthermalfe: -421.529425 hartree
dipole: 2.4291 -1.1025 0.3200
dipole: 2.6867
quadrupole: -46.1015 -51.6102 -47.5044
quadrupole: 9.2292 -4.4031 -1.0925
quadrupole: 2.3038 -3.2048 0.9010 9.2292 -4.4031 -1.0925
hfenergy: -421.6444947 hartree
pointgroup: C01 [X(C5H10O3)]
dipole: -0.9671767 0.4051142 0.1333032 debye
dipolederiv: -0.8092145 -0.1343857 -0.1537066 -0.1766278 -0.632168 -0.0888596 -0.1424596 -0.1087442 -0.4739878 -0.9833787 0.0320486 -0.0698757 0.0262658 -0.5446903 -0.020331 -0.126169 -0.0727581 -0.4076975 -0.9485556 -0.0123276 0.0280819 -0.0245876 -0.1457657 0.1441598 0.0628176 0.1269553 -0.5560414 1.0700298 0.0743527 0.0675305 0.1130981 0.6699524 0.1108925 0.0367112 0.0894112 0.6265087 -0.3526695 -0.0072148 0.0501072 0.0747016 0.0512054 0.0360463 0.0975668 0.0882407 -0.048349 0.4638951 0.1507702 0.1459934 -0.0249189 0.1564006 -0.0358585 0.1647059 0.0672907 0.4327766 0.5277026 0.0507024 -0.0307733 0.2698183 0.2112922 -0.0038843 -0.0342697 -0.0098015 0.3259979 0.7199909 0.0553577 -0.094353 -0.0041971 0.2336918 -0.0496053 -0.0351412 -0.0398369 0.4572028 -0.0376575 -0.0202586 -0.029255 -0.0160205 0.0044728 -0.0174439 -0.069969 -0.0322158 -0.2118358 0.0288558 -0.0671981 -0.0085601 -0.0590374 -0.1414749 -0.016983 -0.0165844 -0.0328844 0.0866033 0.0594732 -0.0001328 -0.0401871 0.0146237 0.0793385 -0.0328691 -0.0433953 -0.0148881 -0.1089683 -0.0174965 -0.119008 -0.0042429 -0.1293422 -0.0390707 0.0076401 0.0157843 0.0428542 0.070788 -0.004777 0.0118534 0.0431001 0.025333 0.0579441 0.0167526 -0.0284577 -0.0523093 -0.208165 -0.03533 0.0334963 -0.0671713 0.0606265 0.0617297 0.0636156 -0.1146992 0.0687217 -0.0068302 -0.0877594 -0.0215652 0.0780292 -0.0759214 0.0325654 0.0035455 0.1678814 -0.0067845 -0.1178233 -0.0270648 -0.004069 0.0121491 0.0062456 0.0566099 -0.06323 0.0007248 -0.0036141 -0.2528264 0.065363 -0.032509 0.0224536 -0.0310809 -0.0937314 0.0047692 0.0077413 -0.0305838 0.0747047 0.3685931 0.0100875 0.0506799 -0.0489788 -0.0183017 -0.058357 0.0572117 -0.0790531 0.3179428 unknown
polarizability: 76.9871522|3.6903693|57.3186683|2.3336349|0.8015931|52.8600694 unknown
InChI: InChI=1S/C5H10O3/c6-2-1-5-7-3-4-8-5/h5-6H,1-4H2
charge 0 multiplicity 1
18 atoms
O  -0.722243 -1.112087 0.313039
O  -1.294933 1.179496 0.024921
O  3.476955 -0.034524 -0.383819
C  -0.248907 0.279195 0.542006
C  1.060951 0.568523 -0.189784
C  -1.937075 -1.016496 -0.530438
C  -2.514286 0.353869 -0.135987
C  2.228744 -0.274706 0.356324
H  -0.156248 0.38651 1.643071
H  1.282826 1.64943 -0.075609
H  0.924988 0.364752 -1.26681
H  -2.582051 -1.870503 -0.270242
H  -1.66893 -1.050714 -1.604294
H  -3.126472 0.83303 -0.915569
H  -3.075169 0.298429 0.817905
H  2.371121 -0.083019 1.44291
H  2.022102 -1.347393 0.217007
H  3.715229 0.924308 -0.308528
