program: Gaussian 09
title: 000231970
version: EM64L-G09RevD.01
frameworkgroup: C1[X(C7H12O4)]
method: RPBEPBE
basis: SDD
operation: Freq
keyword: #pfreq=noraman
keyword: PBEPBE/SDD
title: #p freq=noraman PBEPBE/SDD
converged: YES YES NO NO
title: Mulliken charges:
elementType: O O O O C C C C C C C H H H H H H H H H H H H
charge: -0.285076 -0.275370 -0.271147 -0.248253 0.041806 -0.498453 -0.301952 -0.315891 0.296893 -0.264636 -0.663840 0.221344 0.248369 0.250001 0.208418 0.232622 0.255441 0.218764 0.224093 0.233895 0.216959 0.248828 0.227186
chargesum: 0.00000
title: Mulliken charges with hydrogens summed into heavy atoms:
elementType: O O O O C C C C C C C
charge: -0.285076 -0.275370 -0.271147 -0.248253 0.263149 -0.000083 0.139088 0.158314 0.296893 0.193351 0.029133
polarizability: 1.03957788e+02 4.76769828e+00 8.34185322e+01 1.76036456e+00 -2.28073678e+00 7.04861762e+01
1716.lowfreq: -9.5342 0.0007 0.0009 0.0010 1.9219 15.0215 21.4362 53.2657 87.6088
frequency: 20.7336 53.0322 87.5440 102.7893 116.4239 146.0894 206.1059 234.3458 266.3561 306.0548 334.7516 406.8499 545.8782 555.3387 620.6136 652.2241 712.2296 768.9551 777.7278 815.6781 845.5773 859.9143 905.7711 939.3586 961.5078 983.7971 996.8231 1018.1603 1091.4268 1094.9945 1115.2674 1133.4688 1156.9522 1165.0919 1194.9104 1210.4530 1274.7333 1278.0362 1315.7626 1326.1531 1337.0601 1353.7023 1385.2583 1390.6193 1422.6838 1458.5373 1463.3019 1465.7483 1472.8775 1484.4797 1652.1762 2971.8081 2986.7209 2992.5391 3016.5226 3030.9003 3034.7164 3082.1859 3087.6537 3092.9768 3097.0034 3114.0664 3119.1307
redmass: 4.6114 2.9290 4.9808 3.4313 3.4133 4.3555 1.3815 2.0742 2.8856 2.6668 3.2839 3.7460 3.8405 3.8702 2.4691 6.6047 4.8127 3.1943 3.1771 1.4674 3.6290 2.1941 4.1172 2.9004 2.4033 3.5017 3.0241 3.1830 2.4194 2.1204 2.3736 2.4970 1.6787 1.1377 1.2703 1.2186 1.2047 1.1175 1.6829 1.2713 1.2367 1.2553 1.4010 1.2454 1.0896 1.0910 1.0455 1.0903 1.0987 1.0520 9.0086 1.0850 1.0670 1.0360 1.0640 1.0595 1.0576 1.0969 1.0974 1.1030 1.1001 1.1101 1.1062
irintensity: 0.8734 0.4722 1.7601 13.5088 2.2541 8.3695 1.8958 2.1590 1.5900 10.0317 15.7868 7.2544 23.1474 5.4510 5.1562 2.3058 22.8292 9.4942 24.6593 0.3452 21.9650 0.4202 32.3235 5.2887 11.8405 41.5262 30.4017 75.2974 81.9833 20.5061 104.9602 240.5457 14.8863 3.5986 11.8888 5.0172 10.0435 2.6183 112.5304 0.5478 1.6791 0.8602 20.4032 19.2929 28.7841 13.0246 12.2858 13.1785 5.9950 12.5508 162.7533 70.6810 85.9020 17.7715 9.0524 30.2232 43.0530 4.5882 34.8205 1.1311 15.5752 28.5787 33.3793
temp: 298.150 k
press: 1.00000 atm
elementType: 8 8 8 8 6 6 6 6 6 6 6 1 1 1 1 1 1 1 1 1 1 1 1
symmnumber: 1
zpe: 491130.2 jmol-1
zpe.correction: 0.187062 hartree
zpe.thermalcorrener: 0.198763 hartree
zpe.thermalcorrenthalpy: 0.199708 hartree
zpe.thermalcorrgfe: 0.147720 hartree
zpe.sumelectzpe: -573.928878 hartree
zpe.sumelectthermal: -573.917176 hartree
zpe.sumelectthermalent: -573.916232 hartree
zpe.sumelectthermalfe: -573.968220 hartree
dipole: 0.7572 -0.1352 0.4568
dipole: 0.8945
quadrupole: -52.5008 -63.1387 -68.7336
quadrupole: 1.7350 -1.0976 -3.6020
quadrupole: 8.9569 -1.6810 -7.2759 1.7350 -1.0976 -3.6020
hfenergy: -574.1159393 hartree
pointgroup: C01 [X(C7H12O4)]
dipole: 0.3026593 -0.1738817 -0.0450156 debye
dipolederiv: -0.6214814 -0.1514028 -0.1743414 -0.148769 -0.6087427 -0.1046008 -0.2829853 -0.0800647 -0.673949 -0.5341177 -0.0193125 -0.1643739 0.007955 -0.5335293 0.0622373 -0.2289244 0.0532673 -0.8016237 -1.5641294 0.1905167 -0.1032838 0.3762158 -0.4047344 0.0744919 -0.128245 0.075407 -0.5040445 -0.7353786 0.0620005 0.0274765 0.1328857 -0.3086675 0.0319043 -0.3599344 0.1135431 -0.8599654 0.9036222 0.0710612 0.1395304 0.1072052 0.6876794 0.014 0.2679035 -0.0044799 0.8351925 -0.3966663 0.0412937 0.0158732 0.086429 0.0347454 -0.0912129 0.0878871 -0.0551025 -0.1494007 0.5407085 0.0654016 0.1206186 -0.0607824 0.147588 -0.0316967 0.1881407 0.0988149 0.4247789 0.2825836 -0.0355405 0.0436871 0.0445959 0.1626809 0.183216 0.0837532 0.0022867 0.4956418 1.6866832 -0.3304546 0.0857298 -0.5374883 0.3280437 -0.0816904 0.4839161 -0.1466148 1.0550709 0.7639432 -0.0220179 -0.068363 -0.0495544 0.3420628 -0.0356959 -0.2845282 0.0313086 0.271794 -0.0942024 -0.0542622 0.0287382 -0.0501247 -0.1097475 0.0612947 0.0849256 0.0148622 0.0423056 -0.1106678 0.0325475 0.126078 -0.0068236 0.006399 -0.0362075 0.0474411 -0.0253999 -0.176894 0.0456793 0.0290495 -0.0277955 0.0197702 0.0587175 0.1143235 -0.0117365 0.0711643 0.004061 0.0506323 -0.0209277 0.0083752 -0.0374965 -0.025269 -0.0699945 0.0166089 -0.0357574 0.0925977 -0.252249 -0.0593788 -0.0243427 0.0113085 0.0547667 0.021578 0.0364937 0.0182002 0.0054885 0.0679996 0.0435835 0.0297945 0.0005739 -0.0133056 -0.1159518 -0.0214061 -0.1102512 -0.0237464 0.0432389 -0.0272148 0.1410708 -0.0317683 0.0458498 -0.047242 0.0863572 -0.0132106 -0.0311532 -0.0583555 0.0925763 -0.1259774 0.0797436 0.0410684 0.0611388 -0.0815737 0.0414637 -0.0058465 -0.0488613 0.0709738 -0.019751 0.0772064 -0.0390048 0.0755046 -0.0207972 0.1122558 0.0305628 -0.0001752 -0.0659343 -0.0581695 -0.0319557 0.0272695 -0.0474655 0.0522243 -0.107008 -0.0428867 -0.1138705 0.0351084 0.1130085 0.0193679 0.0837096 -0.0399892 0.1361407 -0.0323703 0.0453267 0.0511345 0.0918046 -0.0757568 0.0477432 -0.0101874 0.0623956 -0.0676029 0.0736973 0.0488007 0.0939299 -0.039471 -0.0378258 -0.0562375 0.0326075 -0.0603375 -0.0840584 -0.0960119 -0.0821111 unknown
polarizability: 103.0007664|-2.3715749|70.1659291|6.2529552|0.7055545|84.695801 unknown
InChI: InChI=1S/C7H12O4/c1-2-9-6(8)5-7-10-3-4-11-7/h7H,2-5H2,1H3
charge 0 multiplicity 1
23 atoms
O  -1.872311 -1.40935 0.288409
O  -2.077159 0.934989 -0.036372
O  2.008429 -0.720172 0.962277
O  0.737925 -0.148177 -0.905757
C  -1.669103 -0.10216 0.927507
C  -0.211785 0.020631 1.392846
C  -2.702428 -1.169633 -0.916519
C  -2.307095 0.257989 -1.340002
C  0.838493 -0.278111 0.334122
C  3.180769 -0.998476 0.074488
C  3.978166 0.282226 -0.187846
H  -2.344982 0.010885 1.800398
H  -0.041792 -0.650696 2.252131
H  -0.056488 1.054945 1.755827
H  -3.777088 -1.24107 -0.656001
H  -2.431763 -1.944923 -1.650018
H  -1.37406 0.267114 -1.927259
H  -3.114383 0.806868 -1.850526
H  3.763354 -1.741253 0.642388
H  2.809909 -1.441927 -0.8662
H  4.884513 0.044078 -0.775156
H  3.377227 1.007125 -0.762168
H  4.294954 0.750196 0.760232
