program: Gaussian 09
title: 000231962
version: EM64L-G09RevD.01
frameworkgroup: C1[X(C7H10N2O3)]
method: RPBEPBE
basis: SDD
operation: Freq
keyword: #p
keyword: freq=noraman
keyword: PBEPBE/SDD
title: #p freq=noraman PBEPBE/SDD
converged: YES YES NO NO
title: Mulliken charges:
elementType: O O O N N C C C C C C C H H H H H H H H H H
charge: -0.228998 -0.236810 -0.211268 -0.240167 -0.384583 -0.011887 0.268755 -0.688633 -0.688569 -0.588894 0.219603 0.172441 0.255571 0.296325 0.296113 0.220883 0.260077 0.219760 0.219784 0.220833 0.260167 0.369499
chargesum: 0.00000
title: Mulliken charges with hydrogens summed into heavy atoms:
elementType: O O O N N C C C C C C C
charge: -0.228998 -0.236810 -0.211268 -0.240167 -0.015084 0.243684 0.268755 0.012086 0.012215 0.003544 0.219603 0.172441
polarizability: 1.21385825e+02 3.57776288e+00 1.04222009e+02 -1.24786078e-02 -4.10838479e-03 6.43036254e+01
1716.lowfreq: -6.4168 -1.6697 -0.0010 -0.0009 -0.0009 6.2123 19.3140 56.3829 84.7694
frequency: 19.2825 56.3625 84.7555 151.3793 173.9804 212.7882 217.3258 228.6190 264.8684 362.5353 398.7343 419.0220 423.9736 474.2821 487.1913 505.6052 596.6139 606.0872 642.3736 680.8956 706.5575 776.9623 884.3084 919.6680 931.5515 940.5093 948.2329 980.4940 1063.7259 1133.0577 1154.6486 1191.5848 1192.9099 1224.9603 1294.8064 1319.6651 1340.1222 1344.7586 1374.8805 1378.0431 1394.6571 1398.9164 1419.1767 1460.5427 1472.3438 1480.9418 1497.9605 1599.4607 1650.8043 1658.8345 2993.1408 2996.1237 3019.5852 3054.5329 3067.6824 3082.6986 3087.4972 3114.6677 3120.6720 3519.4529
redmass: 2.6870 4.8219 3.1536 8.9328 1.9813 2.2846 1.4889 1.3195 3.2100 12.5487 6.4196 3.0647 4.2392 5.5637 4.0945 2.6334 9.0242 3.8050 4.3305 4.1973 4.5095 1.5166 2.6958 3.1003 1.2151 2.5690 1.4372 2.9623 4.3598 2.2778 2.5321 1.1382 2.2274 5.4131 1.4608 3.8731 1.3386 9.2899 1.6784 1.2072 1.2192 1.2594 1.2779 1.0429 1.0546 1.0503 1.0609 9.1492 6.1134 9.2968 1.0363 1.0368 1.0621 1.0858 1.0972 1.0996 1.0989 1.1002 1.0988 1.0768
irintensity: 8.0367 0.7295 3.2337 9.5063 0.0114 1.1692 0.3632 0.4547 8.7321 21.1108 24.7575 2.8216 10.3655 18.7459 5.7691 0.0676 6.2621 10.0615 12.1020 4.5368 0.8827 127.2023 2.0477 0.8920 5.9951 13.6628 0.3907 8.1603 12.6149 121.3195 10.9491 0.0082 4.4658 94.2723 0.1156 344.9438 1.8350 329.3362 3.8533 29.0780 13.2908 57.7403 2.2917 1.3822 39.3301 2.0646 18.0835 417.5619 353.8377 202.6683 30.4527 14.9468 0.9260 4.9407 0.3033 15.9124 46.3090 0.9391 17.0659 65.9928
temp: 298.150 k
press: 1.00000 atm
elementType: 8 8 8 7 7 6 6 6 6 6 6 6 1 1 1 1 1 1 1 1 1 1
symmnumber: 1
zpe: 449782.8 jmol-1
zpe.correction: 0.171313 hartree
zpe.thermalcorrener: 0.183156 hartree
zpe.thermalcorrenthalpy: 0.184101 hartree
zpe.thermalcorrgfe: 0.132343 hartree
zpe.sumelectzpe: -607.056998 hartree
zpe.sumelectthermal: -607.045155 hartree
zpe.sumelectthermalent: -607.044211 hartree
zpe.sumelectthermalfe: -607.095968 hartree
dipole: 1.4060 0.0924 -0.0176
dipole: 1.4091
quadrupole: -78.3045 -80.3170 -67.9113
quadrupole: 0.5798 0.0324 0.0448
quadrupole: -2.7936 -4.8061 7.5997 0.5798 0.0324 0.0448
hfenergy: -607.2283116 hartree
pointgroup: C01 [X(C7H10N2O3)]
dipole: -0.5531369 0.0364631 0.0073843 debye
dipolederiv: -0.7078986 -0.30197 -0.0012799 -0.178689 -0.9559468 -0.0015608 -0.0016153 -0.0020553 -0.3470642 -0.7208388 0.1377808 0.0008465 0.1265013 -1.1592504 -0.0021837 0.0005043 -0.0007625 -0.3485433 -1.2676515 0.1706853 0.0026304 0.0431612 -0.5066137 0.0000645 0.0035785 -0.0002661 -0.35357 -0.9348072 -0.0608979 0.0000698 -0.3674445 -1.4829815 -0.0016907 -0.0003891 -0.0019577 -0.268418 -1.426482 0.2934887 0.0017359 0.7127387 -0.7399331 -0.0016233 0.0029527 -0.0009173 -0.3245858 0.7453501 -0.0511561 -0.000353 -0.1761761 0.0618703 -0.0004541 -0.0008672 -0.0010611 0.3273223 0.8871821 -0.0838725 0.0023407 0.0678829 1.6003619 0.0036201 0.003447 0.003711 0.212888 -0.0838537 -0.0112465 0.0253184 0.0148369 0.0353393 0.0253526 0.0346123 0.0461467 -0.0806625 -0.0837159 -0.0112351 -0.0252888 0.0150587 0.0356202 -0.0248062 -0.034333 -0.0454729 -0.0812229 -0.3594872 -0.0372509 -0.0000793 -0.0268689 -0.2609887 0.0011816 -0.0007806 0.0021666 0.0599968 1.9402948 0.1317185 -0.0020129 0.2918837 1.7094245 0.0027196 -0.0025332 0.0025147 0.2945852 1.5688616 -0.2346586 -0.0048439 -0.600391 1.1128604 0.0006401 -0.0060825 -0.0003994 0.2378035 0.0929292 -0.0249449 -0.000133 0.0664334 -0.009483 -0.0003094 0.0000303 -0.0002091 0.0487801 0.0575431 -0.0214219 0.0163557 -0.024323 0.1133286 -0.0451889 0.0311298 -0.0669443 0.0603313 0.0578958 -0.0216727 -0.0159971 -0.0248052 0.1143272 0.0442875 -0.0306402 0.0658973 0.0586203 -0.1603198 0.0662457 0.023118 0.0760099 0.0819098 0.0049413 0.0094827 0.0152812 0.0908235 0.1383196 0.0269358 -0.0090175 -0.0270791 -0.0691225 0.0446815 -0.0173385 -0.0265798 0.090392 0.055017 -0.0560734 -0.1058212 -0.0454004 0.0557818 -0.0666248 -0.0689389 -0.044525 -0.1020404 0.0549668 -0.0567442 0.1054683 -0.0457889 0.0550978 0.0676147 0.0687496 0.0453834 -0.1012168 -0.1604976 0.0663094 -0.0228016 0.0759528 0.0820636 -0.0049314 -0.0092214 -0.0153264 0.0906758 0.138376 0.0269358 0.0092289 -0.0271459 -0.0687968 -0.0456073 0.0172887 0.0256353 0.0903761 0.168816 0.0530446 0.0005154 0.0536527 0.195131 -0.0001229 0.0009641 -0.0002593 0.3447289 unknown
polarizability: 121.3843619|-3.5810681|104.2233552|-0.0616918|0.0501206|64.303743 unknown
InChI: InChI=1S/C7H10N2O3/c1-4(2)9-6(11)3-5(10)8-7(9)12/h4,8H,3H2,1-2H3
charge 0 multiplicity 1
22 atoms
O  -0.873884 -2.168664 -0.004743
O  -0.137854 2.46824 0.005345
O  3.592268 -0.275573 -0.006503
N  -0.562198 0.147969 0.002662
N  1.678958 1.035267 0.000379
C  -2.054077 0.421633 0.002966
C  -0.088743 -1.183986 -0.000312
C  -2.716688 -0.109929 1.291672
C  -2.715789 -0.10259 -1.289232
C  1.421861 -1.411345 0.002915
C  0.289382 1.284987 0.00381
C  2.33791 -0.201665 -0.00186
H  -2.113108 1.523178 0.006106
H  1.671754 -2.042435 -0.869888
H  1.668936 -2.032513 0.883846
H  -3.771368 0.218606 1.310758
H  -2.692832 -1.210063 1.334244
H  -2.219936 0.297959 2.190116
H  -2.21876 0.31088 -2.184964
H  -3.770654 0.225435 -1.306961
H  -2.691199 -1.202449 -1.338253
H  2.262824 1.878556 -0.001103
