program: Gaussian 09
title: 000231973
version: EM64L-G09RevD.01
frameworkgroup: C1[X(C12H27NO4)]
method: RPBEPBE
basis: SDD
operation: Freq
keyword: #p
keyword: freq=noraman
keyword: PBEPBE/SDD
title: #p freq=noraman PBEPBE/SDD
converged: YES YES NO NO
title: Mulliken charges:
elementType: O O O O N C C C C C C C C C C C C H H H H H H H H H H H H H H H H H H H H H H H H H H H
charge: -0.294899 -0.261797 -0.276954 -0.265192 -0.295085 -0.398562 -0.419613 -0.017565 -0.039732 -0.198565 -0.234713 -0.205921 -0.233734 -0.683607 -0.684004 -0.681976 -0.681482 0.203190 0.216857 0.235668 0.203663 0.229234 0.219044 0.291885 0.213033 0.196881 0.216678 0.198906 0.194163 0.213626 0.201514 0.220498 0.205763 0.224052 0.226500 0.202954 0.221736 0.228178 0.204810 0.224630 0.227760 0.203316 0.222265 0.226595
chargesum: 0.00000
title: Mulliken charges with hydrogens summed into heavy atoms:
elementType: O O O O N C C C C C C C C C C C C
charge: -0.294899 -0.261797 -0.276954 -0.265192 -0.003200 0.021484 0.019718 0.211669 0.179313 0.211350 0.180871 0.201869 0.188278 -0.027291 -0.031135 -0.024776 -0.029306
polarizability: 1.84831269e+02 -1.64519526e+00 1.54473824e+02 -5.14074637e+00 -7.87868209e-02 1.30690731e+02
1716.lowfreq: -6.3893 -1.4654 -0.0007 0.0005 0.0006 4.1604 18.9266 21.6527 32.5800
frequency: 18.3062 20.5694 32.5618 38.0105 43.4683 53.4245 62.2250 75.7097 84.2884 96.5974 98.3861 146.9481 160.5074 174.7531 188.2227 202.4706 215.7816 230.8010 236.0544 240.8515 251.6233 256.3534 261.2296 312.8711 340.4666 350.7585 368.3982 424.2083 479.3151 512.7935 578.4138 628.5518 650.6085 744.9628 757.7955 779.4911 801.8623 810.8580 811.9149 815.9232 820.1208 846.6080 884.8408 915.9552 962.6625 973.9396 1013.1598 1021.1029 1037.8856 1044.9103 1049.7958 1061.1850 1083.7013 1096.8879 1104.4204 1110.0188 1114.7165 1128.4169 1135.6338 1137.3026 1138.3560 1140.8484 1149.6233 1173.4190 1197.8773 1241.3206 1247.5776 1247.7202 1254.0908 1255.7184 1272.9080 1297.7612 1319.0657 1334.3851 1348.9240 1360.0978 1362.6582 1368.4832 1375.0416 1390.9761 1393.4286 1393.8355 1395.7036 1399.1194 1446.3234 1459.8113 1460.2179 1460.4559 1460.9328 1471.1559 1476.8726 1477.8668 1480.6879 1481.4697 1489.8194 1491.8826 1492.9200 1494.5769 1496.9115 2867.9524 2875.2512 2949.5067 2951.7057 2958.4223 2960.9692 2990.1514 2990.4525 2991.4328 2992.4615 3003.8063 3010.4450 3016.4250 3017.0132 3023.3102 3024.6309 3025.8574 3026.8223 3087.2486 3088.0109 3088.9925 3089.6029 3097.1056 3097.3685 3098.0083 3099.1368 3445.1027
redmass: 3.5178 3.5845 2.8822 2.8167 2.8093 2.5220 2.1434 2.2955 1.9985 2.3647 2.6964 2.8884 3.6369 3.1125 2.1465 2.8731 2.4240 2.5715 1.2275 1.2642 1.4090 1.4996 3.3174 3.3930 3.4826 3.6935 3.4182 3.2119 4.2732 3.1367 3.2101 3.4576 4.6215 1.3366 2.7567 2.7084 2.7409 1.1013 1.1012 1.1078 1.0970 2.6358 2.7815 2.9775 4.2598 4.4393 2.0798 2.1118 2.9393 3.0877 2.9814 3.7100 3.1241 2.4999 2.2076 2.1063 2.1129 2.1419 1.5432 1.4429 1.4920 1.4948 2.1352 3.7704 1.3084 1.3071 1.1530 1.1545 1.1544 1.1636 1.2117 1.2417 1.1534 1.2509 1.2519 1.2833 1.2788 1.2905 1.3267 1.3652 1.2573 1.2642 1.3084 1.4403 1.2332 1.0411 1.0415 1.0409 1.0411 1.0913 1.0511 1.0507 1.0451 1.0451 1.0761 1.0826 1.0821 1.0831 1.0831 1.0704 1.0704 1.0601 1.0594 1.0590 1.0572 1.0361 1.0359 1.0359 1.0360 1.0848 1.0847 1.1020 1.1026 1.1043 1.1021 1.0917 1.0891 1.0988 1.0989 1.0989 1.0989 1.1012 1.1012 1.1013 1.1011 1.0740
irintensity: 0.1271 0.0626 0.0698 0.4148 0.1376 0.5594 0.2315 1.8416 2.5081 0.9104 1.0843 14.4966 6.5439 8.6394 4.1613 4.0653 2.5192 1.9151 0.6219 0.1322 4.2831 3.9938 1.7072 2.0367 12.4787 6.7595 6.0491 1.9251 12.8999 5.4281 8.6891 2.8817 3.8759 80.7411 13.9350 10.7013 19.3900 2.5913 6.7795 4.4383 3.8841 6.5776 78.3264 107.2196 164.7782 116.0828 37.3096 41.6393 54.3275 55.2053 186.4590 37.7488 97.0616 27.2079 27.9692 2.8210 16.9932 40.2920 10.3743 5.3068 5.8030 5.1589 4.2364 76.5649 33.5974 7.7655 2.8687 2.1205 0.8141 2.5588 12.0362 13.6635 17.9727 18.4279 5.7954 2.7117 2.1272 1.6886 2.9680 5.6590 26.7557 16.2160 29.2797 11.3251 59.0088 10.7391 9.8140 14.7029 7.4854 6.4549 3.9901 10.6381 1.3928 2.4378 17.6926 11.3607 4.4002 0.6950 0.8041 72.4533 101.0871 50.4840 54.4170 49.0610 58.5063 31.6788 23.8893 26.0186 26.4937 38.1623 37.5690 23.2333 26.3826 14.2009 39.1725 46.6102 45.8490 31.0257 31.2690 43.9430 39.7505 46.8674 39.4078 43.8129 42.3015 5.4379
temp: 298.150 k
press: 1.00000 atm
elementType: 8 8 8 8 7 6 6 6 6 6 6 6 6 6 6 6 6 1 1 1 1 1 1 1 1 1 1 1 1 1 1 1 1 1 1 1 1 1 1 1 1 1 1 1
symmnumber: 1
zpe: 1010662.9 jmol-1
zpe.correction: 0.384941 hartree
zpe.thermalcorrener: 0.407649 hartree
zpe.thermalcorrenthalpy: 0.408593 hartree
zpe.thermalcorrgfe: 0.329188 hartree
zpe.sumelectzpe: -827.627066 hartree
zpe.sumelectthermal: -827.604358 hartree
zpe.sumelectthermalent: -827.603413 hartree
zpe.sumelectthermalfe: -827.682818 hartree
dipole: 0.2430 0.8611 1.2590
dipole: 1.5446
quadrupole: -95.8189 -105.0644 -103.6591
quadrupole: -2.8915 -4.1017 -0.9035
quadrupole: 5.6952 -3.5502 -2.1450 -2.8915 -4.1017 -0.9035
hfenergy: -828.0120067 hartree
pointgroup: C01 [X(C12H27N1O4)]
dipole: -0.090108 -0.3293884 0.5026467 debye
polarizability: 184.6608711|0.0088964|154.3860081|6.3484174|-0.3160703|130.9489447 unknown
InChI: InChI=1S/C12H27NO4/c1-5-14-11(15-6-2)9-13-10-12(16-7-3)17-8-4/h11-13H,5-10H2,1-4H3
charge 0 multiplicity 1
44 atoms
O  2.455298 -0.700422 -0.143233
O  3.657989 1.397053 -0.320446
O  -3.687439 0.867279 -0.04301
O  -2.331183 -1.13639 -0.229224
N  -0.028503 0.628302 -0.509683
C  1.164589 1.302297 0.023538
C  -1.309352 1.144632 -0.003713
C  2.418636 0.685277 -0.610502
C  -2.457967 0.291452 -0.557706
C  3.394713 -1.557009 -0.900773
C  3.989679 1.546797 1.116785
C  -4.903503 0.353059 -0.713011
C  -2.32378 -1.450448 1.220768
C  3.346741 -2.950681 -0.277192
C  5.473415 1.906009 1.195556
C  -6.105926 1.014223 -0.042284
C  -2.521761 -2.961075 1.345773
H  1.24674 1.236449 1.137095
H  1.133515 2.374983 -0.247428
H  -1.456743 2.183394 -0.35366
H  -1.380231 1.168178 1.112371
H  2.353371 0.718262 -1.715839
H  -2.443513 0.2806 -1.666078
H  0.043662 -0.394229 -0.410559
H  4.41119 -1.119403 -0.84698
H  3.081819 -1.581389 -1.966671
H  3.772301 0.597066 1.644308
H  3.367205 2.351233 1.559671
H  -4.854921 0.606968 -1.79394
H  -4.936478 -0.750346 -0.617677
H  -1.354852 -1.143671 1.666966
H  -3.135794 -0.887992 1.721527
H  4.028923 -3.635243 -0.813823
H  3.65242 -2.912697 0.782888
H  2.324893 -3.365346 -0.327984
H  5.776499 2.067616 2.246604
H  6.092894 1.096701 0.771276
H  5.678565 2.829612 0.626717
H  -7.045375 0.674485 -0.51557
H  -6.141993 0.757431 1.030716
H  -6.045644 2.112684 -0.131801
H  -2.506465 -3.265546 2.408577
H  -3.488483 -3.263834 0.907058
H  -1.719145 -3.50272 0.81549
