program: Gaussian 09
title: 000231960
version: EM64L-G09RevD.01
frameworkgroup: C1[X(C15H21NO4)]
method: RPBEPBE
basis: SDD
operation: Freq
keyword: #p
keyword: freq=noraman
keyword: PBEPBE/SDD
title: #p freq=noraman PBEPBE/SDD
converged: YES YES NO NO
title: Mulliken charges:
elementType: O O O O N C C C C C C C C C C C C C C C H H H H H H H H H H H H H H H H H H H H H
charge: -0.245805 -0.264781 -0.287691 -0.253663 -0.085115 -0.336161 -0.346070 -0.327988 -0.326310 -0.318810 -0.427878 -0.301904 0.387124 -0.506373 -0.355337 0.259429 -0.208086 -0.354243 0.177769 -0.501615 0.173597 0.201103 0.188340 0.214135 0.210010 0.190372 0.215795 0.194389 0.193923 0.214163 0.224518 0.235687 0.206673 0.202769 0.290624 0.252431 0.227158 0.271496 0.231078 0.242645 0.242604
chargesum: 0.00000
title: Mulliken charges with hydrogens summed into heavy atoms:
elementType: O O O O N C C C C C C C C C C C C C C C
charge: -0.245805 -0.264781 -0.287691 -0.253663 -0.085115 0.066315 0.054312 0.046712 0.083874 0.089275 0.032327 0.107537 0.387124 -0.215749 -0.102906 0.259429 0.019072 -0.082748 0.177769 0.214712
polarizability: 2.70684262e+02 9.59062248e+00 1.81770100e+02 -3.48552841e+00 3.17480040e+00 1.13085599e+02
1716.lowfreq: -33.8823 -9.2006 -3.4011 -0.0012 -0.0008 0.0005 5.5332 14.6715 29.3651
frequency: -23.6721 13.5444 29.0409 43.7813 63.0885 91.7068 94.2844 98.9789 112.8577 133.2511 144.2966 163.6182 196.7011 210.0317 235.2399 235.4097 277.0697 304.9799 308.0103 330.6466 388.8227 404.6755 434.1753 435.5182 467.6112 474.9558 514.6674 539.2980 597.2536 603.7716 657.0163 682.6945 727.7964 747.5027 762.1978 776.1648 801.7373 807.4677 833.1942 840.8239 877.5775 900.5691 904.8824 933.3708 937.3494 980.7010 981.9931 992.1128 1008.3376 1026.0779 1050.7514 1056.8884 1075.4796 1079.0900 1086.8098 1093.6480 1095.8115 1114.6734 1120.6554 1134.4217 1148.4876 1156.6461 1171.2470 1189.8152 1194.1644 1197.4255 1244.7033 1260.2437 1265.5061 1275.8571 1285.8663 1288.7206 1291.5880 1301.1203 1331.5062 1344.0489 1361.7054 1371.3415 1376.1742 1394.2688 1398.5543 1423.1247 1442.5386 1443.8955 1446.5284 1451.3903 1452.4399 1458.6573 1464.1108 1468.2750 1469.7563 1477.3756 1490.2647 1581.4257 1618.4976 1625.8018 2825.8360 2855.0251 2867.1174 2942.1375 2956.6642 2959.9559 2997.0433 3000.1081 3003.2254 3013.0247 3023.6060 3046.6176 3081.0005 3081.1525 3084.4372 3104.1607 3139.5216 3147.1899 3166.9439 3171.7605 3187.7438
redmass: 3.4896 4.6600 5.4832 4.8987 4.2332 1.8271 2.4152 1.8369 2.6719 3.5615 3.8393 3.4919 3.3853 4.4075 3.6926 2.0976 4.1462 3.5664 2.8445 4.7761 2.0802 4.6819 4.2252 3.2731 3.0410 4.7618 4.8099 4.9431 5.1248 2.0336 6.8254 2.5738 3.4263 6.0041 3.8849 1.1223 1.6102 3.9118 5.8898 1.6037 1.3291 1.7109 1.6424 1.4912 7.6132 5.4954 1.3338 3.9332 3.6509 2.1767 3.0124 2.1715 2.4443 2.4625 2.9288 2.4615 1.6954 1.2640 2.2201 2.5415 1.4821 2.0379 1.5208 1.0767 1.8312 1.3294 1.2596 4.1853 1.2996 1.2440 1.2269 1.3616 1.1306 1.3509 1.2830 1.2443 1.4098 1.3098 1.5574 1.6147 3.4981 1.2074 3.0423 1.0818 1.0825 1.0497 1.0958 1.0973 1.0534 1.9361 1.2037 1.1314 1.1068 6.4619 6.7039 10.0156 1.0706 1.0707 1.0689 1.0548 1.0664 1.0665 1.0860 1.1062 1.0296 1.0609 1.0891 1.0883 1.1025 1.0980 1.0980 1.1044 1.0876 1.1047 1.0934 1.0921 1.0960
irintensity: 0.0439 0.2354 0.2114 3.1947 0.6561 2.2345 0.8964 0.3975 2.0645 0.2660 0.2308 0.8193 6.4650 6.6246 1.8922 1.0476 3.2983 19.4953 11.3283 2.5237 0.4071 1.0764 9.1737 0.4949 0.3588 0.7196 2.8005 5.6275 10.3997 5.9268 2.7143 7.6442 57.1272 9.7454 7.9520 6.8855 24.6678 33.5619 26.5406 0.2064 2.9039 6.4754 4.9196 22.1250 6.9478 32.2272 0.6612 184.3642 86.3463 8.7350 30.3417 1.7102 41.8533 52.8627 30.2458 33.2366 10.8972 0.0695 7.5543 55.3622 60.2726 4.1165 10.3577 2.0646 6.7214 0.3875 25.8915 599.8371 6.4081 7.7040 4.5564 0.4018 5.3036 10.5812 7.3417 10.3460 0.3027 1.2045 24.7302 11.2382 22.7580 19.8558 128.0947 2.6387 2.2018 14.0139 18.6365 2.3606 11.4414 16.5603 5.8125 3.2206 8.3348 107.6639 34.3431 154.8795 70.4370 49.3840 153.0325 37.1778 29.3744 105.2985 16.0453 31.5380 42.4577 18.1927 53.4085 39.9746 20.1270 57.9631 36.4349 27.2604 13.4248 17.5761 13.4014 3.4200 4.9381
temp: 298.150 k
press: 1.00000 atm
elementType: 8 8 8 8 7 6 6 6 6 6 6 6 6 6 6 6 6 6 6 6 1 1 1 1 1 1 1 1 1 1 1 1 1 1 1 1 1 1 1 1 1
symmnumber: 1
zpe: 890335.2 jmol-1
zpe.correction: 0.339111 hartree
zpe.thermalcorrener: 0.358435 hartree
zpe.thermalcorrenthalpy: 0.359380 hartree
zpe.thermalcorrgfe: 0.288852 hartree
zpe.sumelectzpe: -938.269092 hartree
zpe.sumelectthermal: -938.249767 hartree
zpe.sumelectthermalent: -938.248823 hartree
zpe.sumelectthermalfe: -938.319351 hartree
dipole: -0.7345 3.6291 0.2669
dipole: 3.7123
quadrupole: -119.0278 -115.1585 -120.6993
quadrupole: 3.1617 -4.7657 -1.6541
quadrupole: -0.7326 3.1367 -2.4041 3.1617 -4.7657 -1.6541
hfenergy: -938.6082028 hartree
pointgroup: C01 [X(C15H21N1O4)]
dipole: 0.2976545 -1.4273098 -0.0856588 debye
polarizability: 270.6103039|9.6489582|181.5259407|3.8453327|5.8874345|113.4037167 unknown
InChI: InChI=1S/C15H21NO4/c1-18-15(17)13-4-2-5-14(12-13)20-9-3-6-16-7-10-19-11-8-16/h2,4-5,12H,3,6-11H2,1H3
charge 0 multiplicity 1
41 atoms
O  -7.26185 0.872349 0.362279
O  0.351112 0.037511 -0.160374
O  6.391999 0.408796 -0.046358
O  4.939866 2.228746 -0.080482
N  -4.575598 -0.040588 -0.29476
C  -4.823863 0.875461 0.849855
C  -5.768529 -0.898309 -0.52726
C  -3.34292 -0.849947 -0.138468
C  -6.080482 1.721524 0.587161
C  -7.008065 -0.024228 -0.777188
C  -2.056484 0.000855 -0.196125
C  -0.803721 -0.878427 -0.189473
C  1.63704 -0.520687 -0.138721
C  2.699692 0.41171 -0.119944
C  1.910702 -1.912802 -0.132551
C  4.03613 -0.044884 -0.093286
C  3.254693 -2.355474 -0.10589
C  4.321888 -1.437479 -0.085845
C  5.116023 0.985361 -0.073819
C  7.518605 1.369295 -0.026464
H  -3.357119 -1.4419 0.815794
H  -3.326225 -1.583277 -0.969604
H  -4.956808 0.303894 1.804295
H  -3.960367 1.552855 0.975128
H  -5.583632 -1.535988 -1.413035
H  -5.969451 -1.569828 0.346327
H  -6.328179 2.345695 1.461516
H  -5.910817 2.369196 -0.299837
H  -6.859687 0.575718 -1.700949
H  -7.916532 -0.64113 -0.876601
H  -1.994287 0.687775 0.667345
H  -2.072289 0.619933 -1.11081
H  -0.752694 -1.513935 -1.098618
H  -0.781455 -1.535657 0.706016
H  2.487526 1.484843 -0.125905
H  1.100995 -2.647996 -0.147717
H  3.461552 -3.431202 -0.100755
H  5.360668 -1.774668 -0.064981
H  8.421295 0.74275 -0.005221
H  7.495465 2.005079 -0.927611
H  7.458006 2.011961 0.868038
