program: Gaussian 09
title: 000232014
version: EM64L-G09RevD.01
frameworkgroup: C1[X(C24H22Br4O2)]
method: RPBEPBE
basis: SDD
operation: Freq
keyword: #p
keyword: freq=noraman
keyword: PBEPBE/SDD
title: #p freq=noraman PBEPBE/SDD
converged: YES YES NO NO
title: Mulliken charges:
elementType: Br Br Br Br O O C C C C C C C C C C C C C C C C C C C C C C C C H H H H H H H H H H H H H H H H H H H H H H
charge: 0.055161 0.055163 0.000092 0.000093 -0.380935 -0.380935 -0.117093 -0.117091 0.303993 0.303989 0.434079 0.434072 0.404277 0.404278 0.312938 0.312948 -0.717071 -0.717070 0.577724 0.577727 -0.563585 -0.563584 -0.679364 -0.679363 -0.832027 -0.832026 -0.843436 -0.843434 -0.833906 -0.833906 0.247957 0.247957 0.254561 0.264504 0.252545 0.264502 0.252545 0.254562 0.260018 0.232253 0.248121 0.232253 0.260020 0.248118 0.231468 0.253737 0.256304 0.253737 0.231468 0.256304 0.377679 0.377678
chargesum: 0.00000
title: Mulliken charges with hydrogens summed into heavy atoms:
elementType: Br Br Br Br O O C C C C C C C C C C C C C C C C C C C C C C C C
charge: 0.055161 0.055163 0.000092 0.000093 -0.003256 -0.003257 -0.117093 -0.117091 0.303993 0.303989 0.434079 0.434072 0.404277 0.404278 0.312938 0.312948 -0.717071 -0.717070 0.577724 0.577727 -0.563585 -0.563584 -0.431406 -0.431407 -0.060417 -0.060417 -0.103044 -0.103043 -0.092396 -0.092396
polarizability: 4.95862629e+02 3.01082076e-02 3.12398130e+02 -8.43533611e+00 -8.83238545e-02 2.55562600e+02
1716.lowfreq: -5.7355 -2.5688 -1.2919 0.0004 0.0005 0.0007 8.1896 14.0665 15.5217
frequency: 8.1881 13.9614 15.5215 28.3348 38.4276 54.0068 54.7550 77.8294 78.2625 103.1836 104.0204 104.3781 112.7277 122.4664 127.1051 133.2135 134.8102 144.1783 144.7332 161.1313 161.4716 188.4841 193.6503 200.6702 202.6797 210.1289 230.4893 238.2456 240.6425 267.0389 279.2073 282.0789 289.4213 297.1746 306.3485 308.0846 344.6221 346.9831 353.1790 380.8551 393.0675 424.8896 452.6818 456.7077 466.5333 495.0219 512.7251 530.8759 535.0773 542.6486 543.1420 563.6718 564.2569 570.3037 583.5863 586.8114 603.4743 631.8948 670.1638 675.6374 703.6587 735.1402 760.7550 795.8484 807.9633 831.7229 877.3752 877.4814 923.3932 943.9552 945.9853 963.0456 972.4012 1018.5999 1019.5294 1031.1875 1031.4479 1037.3058 1038.2971 1044.0599 1044.1246 1044.1374 1044.8669 1048.7623 1049.5216 1052.9924 1150.1180 1157.2071 1189.0717 1204.9978 1233.0597 1244.1021 1314.4593 1315.9057 1334.5455 1335.3192 1337.6018 1350.5358 1376.3396 1381.1444 1396.3556 1400.8621 1401.0735 1401.3733 1402.8026 1403.8752 1404.2800 1430.3591 1436.8449 1458.5822 1462.6167 1462.6585 1465.4288 1467.4826 1467.9751 1468.3882 1470.8873 1470.9673 1474.0147 1474.1381 1481.8043 1486.3661 1520.2002 1553.3103 1553.7863 1598.3728 1598.7401 1619.2229 2980.1449 2980.5316 2984.0701 2984.0890 2988.5426 2988.7316 3058.1496 3058.2887 3062.7906 3062.8063 3063.6045 3063.7052 3088.8730 3089.2020 3093.9993 3094.0187 3109.2373 3109.4488 3129.0429 3129.1133 3476.2928 3478.6953
redmass: 6.0961 14.8908 12.1067 4.7841 6.8188 16.8009 7.9260 3.4925 3.5935 4.3169 12.5780 10.1091 4.4407 4.6205 1.7537 1.8079 1.2056 1.0987 1.0569 1.0861 1.0881 2.6702 2.5888 4.8120 13.4587 7.0269 5.6963 6.6717 7.1529 4.5856 4.9719 4.6595 4.2197 5.0308 3.1104 3.3328 3.0021 3.3285 7.0006 4.7539 4.6784 3.9010 1.1087 1.2523 9.1297 6.9074 3.4360 3.2440 3.1665 5.2177 4.0470 4.0208 4.6786 4.5969 6.3573 5.0712 5.5144 9.7085 5.2819 4.7385 7.9811 4.3034 5.0551 10.3392 7.3751 8.6592 1.3008 1.3022 5.1159 2.5854 2.7040 3.4086 4.9391 1.6707 1.6596 1.9889 1.9806 1.6315 1.5264 1.5815 1.5742 1.5486 1.6053 1.8578 1.5693 3.3914 2.2829 5.8508 1.5446 2.1120 1.5158 1.8998 5.9490 6.8915 8.3183 6.5000 7.3457 4.7793 5.1378 4.6741 2.5169 1.3430 1.2012 1.2524 1.2274 1.2305 1.2191 2.4471 4.1039 1.7312 1.0446 1.0446 1.0464 1.0496 1.0480 1.0548 1.1216 1.1063 1.1990 1.2232 1.2923 2.0938 8.7871 6.2541 6.2621 6.5459 6.5443 8.4689 1.0374 1.0374 1.0372 1.0372 1.0383 1.0383 1.0972 1.0972 1.0970 1.0970 1.0971 1.0971 1.0992 1.0991 1.0996 1.0996 1.0979 1.0979 1.0916 1.0916 1.0644 1.0647
irintensity: 0.0076 0.1104 0.0524 0.3780 0.0028 0.0005 0.0906 0.0190 0.0097 0.0197 0.2827 0.0370 1.2155 0.6118 0.1427 0.0028 0.7130 0.1150 1.3807 0.6334 1.1443 0.0438 4.4650 0.0278 0.1184 0.6662 0.1412 1.6858 1.8703 5.9972 1.3870 5.7719 0.0546 18.1043 0.3760 0.1825 0.0371 0.8226 0.1453 0.1286 4.8749 0.3719 142.8913 0.9164 0.5476 16.4909 0.0755 0.2421 3.8164 1.1465 5.6609 0.2893 1.5500 1.1862 12.8524 4.8546 20.2963 0.0066 6.8665 0.1089 4.4067 2.5968 0.0822 2.2494 2.5556 127.7965 3.8716 8.7164 0.2081 0.8571 0.5441 54.2568 92.7071 33.2080 15.9217 2.8983 0.2054 11.4411 0.0061 0.5883 1.9261 0.9937 1.7162 17.3518 0.2825 58.4484 327.8345 17.8788 1.1030 45.2866 0.5136 35.4035 0.1422 1.3240 226.3604 0.0225 1.0474 0.0275 4.3726 34.1130 32.2697 4.5611 32.8891 15.5905 6.7150 12.8029 2.9257 3.2321 85.7619 1.3832 8.5243 14.9200 0.2866 31.5988 0.0158 17.3046 4.2706 0.3304 16.6775 70.4836 5.3537 57.2231 0.0087 9.5201 0.8493 1.0511 7.0064 0.0085 10.2329 31.6283 39.3746 6.3055 1.2771 15.2143 0.0134 16.3355 8.7995 14.6270 0.4601 9.7239 36.0348 20.1401 13.9761 23.8761 33.4709 0.1120 13.3070 21.5258 243.2902 0.0839
temp: 298.150 k
press: 1.00000 atm
elementType: 35 35 35 35 8 8 6 6 6 6 6 6 6 6 6 6 6 6 6 6 6 6 6 6 6 6 6 6 6 6 1 1 1 1 1 1 1 1 1 1 1 1 1 1 1 1 1 1 1 1 1 1
symmnumber: 1
zpe: 1015390.1 jmol-1
zpe.correction: 0.386742 hartree
zpe.thermalcorrener: 0.419861 hartree
zpe.thermalcorrenthalpy: 0.420805 hartree
zpe.thermalcorrgfe: 0.317273 hartree
zpe.sumelectzpe: -1129.913750 hartree
zpe.sumelectthermal: -1129.880631 hartree
zpe.sumelectthermalent: -1129.879687 hartree
zpe.sumelectthermalfe: -1129.983219 hartree
dipole: 0.0000 -3.0305 0.0032
dipole: 3.0306
quadrupole: -190.1838 -202.5290 -228.1252
quadrupole: 0.0075 6.9588 -0.0273
quadrupole: 16.7622 4.4171 -21.1792 0.0075 6.9588 -0.0273
hfenergy: -1130.3004917 hartree
pointgroup: C01 [X(C24H22Br4O2)]
dipole: -0.0000149 -1.1923105 0.0001493 debye
polarizability: 494.5282609|0.0327378|312.3982435|-19.7489991|-0.0368896|256.8968543 unknown
InChI: InChI=1S/C24H22Br4O2/c1-9-7-11(3)19(25)13(5)15(9)17-21(27)24(30)18(22(28)23(17)29)16-10(2)8-12(4)20(26)14(16)6/h7-8,29-30H,1-6H3
charge 0 multiplicity 1
52 atoms
Br 1.554207 -0.130749 -2.969512
Br -1.554381 -0.129805 2.969486
Br -6.161195 2.628748 -0.007547
Br 6.161082 2.628608 0.006952
O  -1.44914 -0.131552 -2.406528
O  1.448965 -0.130843 2.406501
C  -2.936135 -0.155295 0.018934
C  2.93596 -0.155367 -0.018948
C  -1.434028 -0.123848 0.049814
C  1.433853 -0.123892 -0.049842
C  -3.684908 1.064079 0.021035
C  3.684761 1.06399 -0.021328
C  -3.596648 -1.420772 -0.023529
C  3.596442 -1.420849 0.023832
C  -0.745285 -0.125822 -1.198948
C  0.745109 -0.125471 1.198921
C  0.667544 -0.126511 -1.236897
C  -0.667719 -0.126119 1.23687
C  -5.795996 -0.270072 -0.062214
C  5.795816 -0.27019 0.062293
C  -5.099945 0.96257 -0.02011
C  5.099795 0.962457 0.019876
C  -5.007746 -1.44838 -0.06557
C  5.007538 -1.448479 0.065909
C  -2.989708 2.409111 0.080913
C  2.989593 2.409023 -0.081549
C  -2.807473 -2.717128 -0.003281
C  2.807235 -2.717191 0.003874
C  -7.30644 -0.364023 -0.102578
C  7.306257 -0.364167 0.102721
H  -5.520893 -2.41655 -0.096183
H  5.520662 -2.416654 0.096767
H  -3.290566 3.054362 -0.764402
H  -3.266236 2.948463 1.005686
H  -1.895068 2.297053 0.064614
H  3.266191 2.948162 -1.006426
H  1.89495 2.296988 -0.065294
H  3.290411 3.054457 0.76364
H  -2.24127 -2.818517 0.941434
H  -3.475794 -3.589506 -0.095286
H  -2.069213 -2.762926 -0.825047
H  3.475531 -3.589563 0.096119
H  2.241067 -2.818796 -0.940838
H  2.068943 -2.762766 0.825623
H  -7.633804 -1.416354 -0.135051
H  -7.718974 0.156754 -0.986321
H  -7.7613 0.114258 0.784369
H  7.718776 0.156797 0.986361
H  7.633597 -1.416498 0.135436
H  7.761154 0.113908 -0.784318
H  -2.425547 -0.112875 -2.213262
H  2.425372 -0.112255 2.213229
