program: Gaussian 09
title: 000231926
version: EM64L-G09RevD.01
frameworkgroup: C1[X(C9H17N3O3)]
method: RPBEPBE
basis: SDD
operation: Freq
keyword: #p
keyword: freq=noraman
keyword: PBEPBE/SDD
title: #p freq=noraman PBEPBE/SDD
converged: YES YES NO NO
title: Mulliken charges:
elementType: O O O N N N C C C C C C C C C H H H H H H H H H H H H H H H H H
charge: -0.274989 -0.295959 -0.291831 -0.074278 -0.305842 -0.308437 -0.366000 -0.375456 -0.372799 -0.364738 -0.398793 -0.395529 -0.066405 -0.039089 -0.039311 0.219797 0.250948 0.225070 0.208650 0.241560 0.233163 0.254594 0.219089 0.256107 0.216448 0.258702 0.208376 0.157932 0.313469 0.312730 0.193539 0.199281
chargesum: 0.00000
title: Mulliken charges with hydrogens summed into heavy atoms:
elementType: O O O N N N C C C C C C C C C
charge: -0.274989 -0.295959 -0.291831 -0.074278 0.007627 0.004293 0.104745 0.058264 0.101925 0.108945 0.073762 0.071549 0.091527 0.154449 0.159970
polarizability: 1.45400567e+02 1.26324499e+00 1.22108367e+02 -3.01599398e+00 8.62528758e+00 1.05155502e+02
1716.lowfreq: -13.5454 -9.3841 -7.2427 -0.0009 -0.0005 -0.0003 23.0245 33.0765 35.1519
frequency: 22.5700 32.9819 34.5169 54.3578 58.6504 73.5449 122.1332 128.4488 142.4602 177.1462 202.2988 232.7902 264.5280 274.6915 292.9822 301.9113 308.8254 336.2394 390.9801 451.2066 499.0957 544.5378 552.1110 557.7420 668.7532 732.0653 739.1212 749.0502 766.9429 835.6499 875.4546 876.3372 887.6195 922.9108 957.3338 959.8759 962.4744 1023.6280 1026.6909 1068.7759 1074.8873 1083.5972 1092.9182 1163.4512 1177.9392 1198.6541 1203.2526 1242.0286 1256.0435 1257.8399 1275.2593 1295.2539 1319.9860 1330.6002 1350.5485 1351.9867 1368.8969 1370.0081 1374.5694 1380.1851 1382.7567 1408.8966 1445.9185 1449.5869 1457.9259 1470.2454 1471.1545 1475.8588 1480.3458 1485.7244 1620.5064 1625.9337 1632.6504 2919.6363 2970.0466 2979.0910 2979.8373 2996.8982 3001.1065 3005.0590 3008.9350 3011.8524 3033.0593 3054.0104 3062.9749 3067.6776 3080.7058 3083.7834 3547.8856 3549.5796
redmass: 7.4692 5.1123 4.5374 5.2635 5.8552 8.6667 4.1270 3.2971 2.7161 3.5113 2.5611 2.9456 2.5029 2.5114 2.6226 2.6261 2.9179 3.1984 2.6258 3.8216 3.3421 2.9049 1.1395 1.1943 3.1623 2.9469 3.3138 1.3505 1.5743 2.6521 2.8954 2.6279 1.9911 2.5026 1.5891 1.6022 1.6039 2.4746 2.4358 2.4700 2.8210 2.5064 2.3117 1.7246 1.5836 2.2895 2.1353 1.8008 1.2644 1.2661 1.3313 1.1645 1.2163 1.1973 1.2694 1.2484 1.3684 1.3553 1.2460 1.2442 1.3028 2.1085 1.2241 1.2237 1.0737 1.1045 1.0963 1.4987 1.5207 1.0927 5.1400 5.9632 4.8934 1.0853 1.0881 1.0885 1.0587 1.0601 1.0611 1.0591 1.0621 1.0603 1.1002 1.1009 1.1041 1.1047 1.1022 1.1037 1.0788 1.0788
irintensity: 9.8744 18.8003 4.4033 2.6011 0.6571 3.1280 15.2060 15.8210 7.2099 2.5918 9.6097 3.2474 5.7386 8.6388 25.4468 40.3864 12.1534 38.9210 9.1339 13.1693 29.9085 19.5378 101.8201 113.0237 2.3649 5.0371 5.7665 7.8507 23.1067 2.9435 0.9773 1.2229 9.0188 2.4437 2.1034 1.5896 0.9509 2.7906 8.0867 0.9670 2.2225 5.6370 53.7519 22.5928 24.3523 10.2090 46.6729 14.8014 9.1240 8.0017 16.9670 7.4932 1.2239 3.8505 24.3198 4.1286 3.6509 25.0298 12.7744 19.9513 23.0594 51.3110 22.9442 54.0850 1.1040 12.7380 2.5462 91.4719 87.9891 46.6182 255.7030 210.7536 309.4348 93.4114 64.2802 58.6795 28.2297 9.1286 25.1218 42.3354 26.3174 36.3979 16.7910 1.2880 18.2359 13.2564 40.2970 20.5595 22.7042 18.5106
temp: 298.150 k
press: 1.00000 atm
elementType: 8 8 8 7 7 7 6 6 6 6 6 6 6 6 6 1 1 1 1 1 1 1 1 1 1 1 1 1 1 1 1 1
symmnumber: 1
zpe: 700036.6 jmol-1
zpe.correction: 0.266630 hartree
zpe.thermalcorrener: 0.283525 hartree
zpe.thermalcorrenthalpy: 0.284469 hartree
zpe.thermalcorrgfe: 0.219423 hartree
zpe.sumelectzpe: -741.903737 hartree
zpe.sumelectthermal: -741.886842 hartree
zpe.sumelectthermalent: -741.885897 hartree
zpe.sumelectthermalfe: -741.950944 hartree
dipole: 1.7997 -1.6846 -1.0184
dipole: 2.6672
quadrupole: -121.3877 -73.3520 -89.5363
quadrupole: -2.8494 0.0790 13.9559
quadrupole: -26.6291 21.4067 5.2224 -2.8494 0.0790 13.9559
hfenergy: -742.1703669 hartree
pointgroup: C01 [X(C9H17N3O3)]
dipole: -0.8533756 -0.4105206 -0.4521094 debye
polarizability: 123.3010841|7.2524027|143.0063024|10.2123902|-0.1878739|106.3570491 unknown
InChI: InChI=1S/C9H17N3O3/c13-7-10-3-1-5-12(9-15)6-2-4-11-8-14/h7-11H,1-6H2
charge 0 multiplicity 1
32 atoms
O  1.392669 4.060807 0.363353
O  1.145453 -2.625535 -1.03089
O  -1.846858 -2.196898 1.126789
N  0.172292 2.096308 -0.071753
N  2.15252 -1.676985 0.855541
N  -2.551051 -1.181014 -0.858023
C  1.187969 1.211895 0.540611
C  -1.039127 1.490101 -0.660418
C  2.030367 0.451513 -0.508334
C  -2.036524 0.955019 0.393357
C  2.921799 -0.646252 0.12341
C  -3.115852 0.026118 -0.216544
C  0.381353 3.464348 -0.106056
C  1.326476 -2.579966 0.223657
C  -1.961768 -2.197375 -0.135642
H  0.676677 0.487967 1.202178
H  1.8367 1.85624 1.160844
H  -0.734934 0.656601 -1.322854
H  -1.529381 2.251627 -1.29795
H  1.377865 -0.035679 -1.254528
H  2.679221 1.165689 -1.048912
H  -1.502254 0.379327 1.169108
H  -2.537714 1.800108 0.902919
H  3.493057 -1.142884 -0.682069
H  3.645186 -0.202807 0.831867
H  -3.798205 -0.295122 0.591433
H  -3.715348 0.561012 -0.976363
H  -0.455047 4.004614 -0.608144
H  2.209167 -1.711849 1.875055
H  -2.580037 -1.269978 -1.875238
H  0.813863 -3.264912 0.933488
H  -1.579138 -3.018437 -0.778792
