program: Gaussian 09
title: 000231901
version: EM64L-G09RevD.01
frameworkgroup: C1[X(C6H12OS)]
method: RPBEPBE
basis: SDD
operation: Freq
keyword: #p
keyword: freq=noraman
keyword: PBEPBE/SDD
title: #p freq=noraman PBEPBE/SDD
converged: YES YES NO NO
title: Mulliken charges:
elementType: S O C C C C C C H H H H H H H H H H H H
charge: 0.157165 -0.273313 -0.012055 0.068053 -0.662008 -0.674691 -0.690120 -0.701908 0.219085 0.208866 0.242722 0.272839 0.255990 0.246490 0.234789 0.215964 0.231613 0.223711 0.236311 0.200497
chargesum: 0.00000
title: Mulliken charges with hydrogens summed into heavy atoms:
elementType: S O C C C C C C
charge: 0.157165 -0.273313 0.207030 0.276919 -0.146447 -0.172211 -0.007755 -0.041389
polarizability: 9.64549710e+01 4.77476767e+00 8.19375895e+01 2.22991135e+00 4.18687439e+00 6.82066714e+01
1716.lowfreq: -16.6894 -8.2642 -0.0034 -0.0031 -0.0019 14.0155 124.0357 145.0683 193.1273
frequency: 124.0278 145.0584 193.1223 202.0846 203.8797 282.1749 297.0766 346.9545 384.2349 433.3418 460.7342 580.2413 683.8064 694.9252 728.4550 823.8475 846.8741 887.9897 910.4702 941.9422 1012.6612 1036.4923 1054.3757 1092.7156 1125.2173 1144.1945 1181.1614 1204.9772 1230.8141 1253.5600 1318.7851 1321.6080 1328.9250 1337.1811 1376.2599 1384.3802 1415.6948 1425.9247 1457.0885 1461.9809 1476.1200 1481.7089 2970.2050 2986.9473 2990.7644 3003.1804 3016.5847 3026.2252 3081.1808 3088.6063 3097.9292 3099.0132 3100.8554 3100.9334
redmass: 2.7073 2.6057 1.2509 1.0941 2.1259 2.7848 3.0000 3.0676 3.2668 3.0839 2.5710 4.1561 3.7012 3.9237 3.5284 1.9033 1.9800 1.8421 1.7617 2.3799 1.6915 1.5124 1.7237 2.0654 1.8324 2.1849 1.4569 1.2764 1.2645 1.3689 1.3650 1.4631 1.2123 1.2192 1.2300 1.2370 1.0952 1.0935 1.0467 1.0475 1.0484 1.0513 1.0827 1.0373 1.0357 1.0808 1.0580 1.0617 1.0982 1.1011 1.1036 1.1015 1.1039 1.1037
irintensity: 2.1166 5.7234 0.5083 0.5869 1.1094 0.8597 1.0758 0.3125 1.7184 2.9502 10.4042 2.7549 6.7231 4.9449 6.7200 2.4396 0.1548 0.8103 4.4308 25.6241 33.8903 12.4771 8.5327 21.6372 18.4393 14.2768 17.7558 11.2372 8.0315 4.3694 14.5897 5.3476 5.8952 1.4733 38.8952 21.9706 6.5875 12.2198 10.6728 10.6674 9.8507 6.6741 25.2469 26.1366 21.9180 15.5969 29.9584 42.7512 27.4855 12.5318 9.2554 35.1291 31.4656 15.3110
temp: 298.150 k
press: 1.00000 atm
elementType: 16 8 6 6 6 6 6 6 1 1 1 1 1 1 1 1 1 1 1 1
symmnumber: 1
zpe: 447735.3 jmol-1
zpe.correction: 0.170533 hartree
zpe.thermalcorrener: 0.179601 hartree
zpe.thermalcorrenthalpy: 0.180545 hartree
zpe.thermalcorrgfe: 0.137149 hartree
zpe.sumelectzpe: -708.449661 hartree
zpe.sumelectthermal: -708.440593 hartree
zpe.sumelectthermalent: -708.439649 hartree
zpe.sumelectthermalfe: -708.483045 hartree
dipole: -0.2096 0.5032 -0.1352
dipole: 0.5616
quadrupole: -53.9036 -60.1523 -57.4069
quadrupole: 6.2869 3.5049 -1.3288
quadrupole: 3.2506 -2.9980 -0.2526 6.2869 3.5049 -1.3288
hfenergy: -708.6201942 hartree
pointgroup: C01 [X(C6H12O1S1)]
dipole: 0.0413515 -0.213256 -0.0403675 debye
dipolederiv: -0.2335562 0.0122804 0.0458378 0.0036291 -0.272676 -0.0607324 0.032204 -0.0396527 -0.1273436 -0.8973607 -0.1187513 0.0549991 -0.1284125 -0.5347713 -0.0498996 0.117466 -0.0426047 -0.4157615 0.6633272 0.0436529 0.0549638 -0.0000664 0.3466085 0.096682 0.1383361 0.2048055 0.2775244 0.4061159 0.1213671 -0.0998715 0.1115036 0.4515742 -0.0098371 -0.2707812 0.0084932 0.3473089 0.0250264 0.1247405 -0.089482 0.124445 0.0741768 -0.0825382 -0.0945734 -0.126902 0.1369196 0.2633333 -0.0430871 0.0502682 -0.038096 -0.0639236 0.0375125 0.0702994 0.0253868 0.0860065 -0.0649689 -0.0351976 -0.0712841 -0.0372716 -0.0569068 -0.1115579 -0.1037166 -0.0925556 -0.1541589 -0.1089135 0.0346516 -0.0207976 0.1517793 -0.0348113 0.0016589 -0.0038382 0.0024617 0.0843635 -0.020065 -0.02292 0.0407579 -0.0796749 -0.0614973 0.1030136 0.0558691 0.0706962 -0.0644561 0.0023857 -0.0275234 -0.0709804 -0.0335616 -0.0083833 -0.0247805 0.0153105 -0.0340861 -0.1748614 -0.1355464 0.0076174 0.0131713 0.0022174 0.0711144 0.0193382 -0.0117928 0.0280404 0.0912506 0.0746985 -0.0444412 -0.0490921 -0.051479 -0.0219038 -0.0051812 0.0246723 -0.0229551 -0.1488029 -0.026922 0.0083003 -0.0562618 0.0476886 0.0499232 -0.0030817 -0.097816 -0.0769619 -0.1002078 -0.0331049 -0.0651098 0.0676059 -0.0608162 0.0314562 0.0492253 0.0783486 0.0755999 0.0299096 0.0720153 0.1122714 0.0223759 0.0629656 -0.099984 -0.0566984 0.0049961 -0.04319 0.0707941 -0.1732695 -0.0582692 -0.0138644 -0.0208964 0.0948914 -0.0129611 0.0109017 -0.0004802 0.0897762 0.085777 -0.0222905 0.0678291 -0.0138017 0.04522 0.1290186 0.0297063 0.0645956 -0.0149441 0.0761383 0.0020579 -0.0120914 -0.0181035 0.084664 -0.0714453 -0.0871287 -0.0447905 -0.1146143 0.0586366 0.029045 -0.004329 0.0852832 -0.1351739 -0.0348524 -0.0137111 -0.0321122 0.0968451 -0.0337471 -0.0583945 0.0702452 -0.1073321 0.0404026 0.0871167 0.1052479 0.0762116 0.0044523 unknown
polarizability: 97.9179126|1.4195514|80.1960048|-2.2586634|-4.2598834|68.4853145 unknown
InChI: InChI=1S/C6H12OS/c1-5-3-8-4-6(2)7-5/h5-6H,3-4H2,1-2H3
charge 0 multiplicity 1
20 atoms
S  -0.794243 1.875832 -0.485353
O  0.329847 -0.945387 0.622285
C  -1.136282 -0.811519 0.426003
C  1.187024 -0.159024 -0.297833
C  -1.59806 0.634585 0.699014
C  0.985347 1.353019 -0.094409
C  -1.609784 -1.370117 -0.928763
C  2.620274 -0.598461 0.025824
H  -1.532414 -1.452407 1.23771
H  0.937934 -0.418176 -1.348633
H  -2.686313 0.740436 0.551927
H  -1.334628 0.932193 1.728125
H  1.21015 1.636105 0.949038
H  1.622998 1.93511 -0.781373
H  -1.137204 -2.349785 -1.116698
H  -2.706129 -1.514518 -0.912303
H  -1.370359 -0.684536 -1.759949
H  2.863693 -0.371942 1.078975
H  2.722175 -1.68677 -0.123343
H  3.346975 -0.081437 -0.626843
