program: Gaussian 09
title: 000231904
version: EM64L-G09RevD.01
frameworkgroup: C1[X(C9H9N3OS)]
method: RPBEPBE
basis: SDD
operation: Freq
keyword: #p
keyword: freq=noraman
keyword: PBEPBE/SDD
title: #p freq=noraman PBEPBE/SDD
converged: YES YES NO NO
title: Mulliken charges:
elementType: S O N N N C C C C C C C C C H H H H H H H H H
charge: 0.208641 -0.263929 -0.448636 -0.038012 -0.568763 -0.318622 0.362147 0.519019 -0.406184 -0.321847 -0.468806 -0.177726 0.211110 -0.800074 0.323391 0.252180 0.218673 0.309726 0.236216 0.268961 0.235967 0.330644 0.335924
chargesum: 0.00000
title: Mulliken charges with hydrogens summed into heavy atoms:
elementType: S O N N N C C C C C C C C C
charge: 0.208641 -0.263929 -0.138910 -0.038012 0.097805 -0.318622 0.362147 0.519019 -0.082793 -0.069668 -0.250133 -0.177726 0.211110 -0.058930
polarizability: 2.45090173e+02 -7.96899848e+00 1.44449003e+02 -1.09591293e-02 8.01245510e-03 5.82373503e+01
1716.lowfreq: -83.8057 0.0012 0.0017 0.0019 2.1678 8.8402 9.9520 58.6441 63.2325
frequency: -83.8044 58.6357 63.2298 117.2620 126.2696 185.2718 240.9594 241.9003 283.6187 311.0260 337.9729 392.5356 408.1594 431.2582 446.5780 462.6762 501.7343 550.3449 565.4923 581.3478 584.2807 608.8889 631.8410 652.5012 687.0962 734.5556 815.8142 816.9498 887.6846 924.0119 929.6951 939.6264 990.7902 1024.1370 1029.4461 1056.0726 1133.3760 1206.3103 1235.5708 1253.4108 1265.7733 1306.4070 1351.6273 1375.7189 1421.7603 1448.4803 1466.8045 1468.6216 1502.4354 1568.1724 1587.6950 1613.9956 1628.7666 1646.2990 2986.6424 3071.4596 3116.8646 3135.5165 3171.0610 3191.7224 3524.6131 3555.0431 3706.2047
redmass: 1.0492 5.9345 4.7516 5.8008 4.5859 5.6813 5.6118 5.3796 4.1760 1.2955 5.4288 2.4454 6.6399 2.3208 1.6385 4.7328 8.7532 4.6382 3.5100 5.4424 4.9172 3.0667 1.2180 6.4024 7.0398 4.6772 1.5165 5.1822 4.7526 1.3567 6.3209 1.3638 1.6637 2.9227 1.6518 2.1768 1.3985 2.1771 2.2946 2.7692 1.5110 4.3195 3.6875 1.2439 5.3376 1.1483 4.2075 1.0470 1.9946 4.4435 2.0269 3.0029 4.8866 3.8433 1.0384 1.0984 1.0899 1.0978 1.0948 1.0935 1.0765 1.0451 1.1046
irintensity: 0.0017 0.0050 14.8732 6.9992 4.1695 1.3506 1.1274 2.2976 2.3911 54.5519 6.4576 105.2537 0.8870 16.5179 168.9131 14.9734 1.2640 22.1085 18.0639 2.7741 2.5062 8.1097 57.5861 2.1034 7.4696 0.5458 67.5662 9.7707 10.6042 32.6966 5.5129 1.0794 46.4439 2.6761 8.0313 10.8669 5.9182 28.4689 140.2835 41.0248 5.2364 36.6505 66.0754 53.3133 78.5595 58.9249 335.7734 19.7098 114.8245 238.2866 28.1532 24.1534 122.0669 586.1633 11.1067 16.3456 21.0631 7.0443 6.8405 14.4784 13.2192 164.1015 48.5211
temp: 298.150 k
press: 1.00000 atm
elementType: 16 8 7 7 7 6 6 6 6 6 6 6 6 6 1 1 1 1 1 1 1 1 1
symmnumber: 1
zpe: 445967.9 jmol-1
zpe.correction: 0.169860 hartree
zpe.thermalcorrener: 0.182142 hartree
zpe.thermalcorrenthalpy: 0.183086 hartree
zpe.thermalcorrgfe: 0.131076 hartree
zpe.sumelectzpe: -984.929436 hartree
zpe.sumelectthermal: -984.917154 hartree
zpe.sumelectthermalent: -984.916210 hartree
zpe.sumelectthermalfe: -984.968220 hartree
dipole: 0.5407 2.3752 0.0138
dipole: 2.4360
quadrupole: -51.8837 -89.0362 -93.4156
quadrupole: -19.0553 0.0704 -0.0002
quadrupole: 26.2281 -10.9244 -15.3037 -19.0553 0.0704 -0.0002
hfenergy: -985.0992963 hartree
pointgroup: C01 [X(C9H9N3O1S1)]
dipole: -0.2661816 -0.9206899 0.0058826 debye
dipolederiv: -0.5148572 -0.0304242 0.0000913 -0.0808554 -0.4004966 0.0001366 0.0002436 0.0002752 0.0504981 -0.5865201 0.1403227 -0.0001135 -0.5963083 -0.9627049 0.0003342 0.0000522 0.0003384 -0.3423241 -1.6907003 -0.3448226 0.000064 -0.7569564 -0.5430376 -0.0000185 0.000304 0.0001049 -0.3216127 -1.1189654 0.1756878 -0.0003203 0.662259 -0.9510135 0.0010145 -0.0009354 0.000561 -0.2349548 -1.8894205 0.4286358 -0.0025148 0.3882353 -0.3280726 -0.0007443 -0.0085874 0.001368 -0.7084018 0.1903522 -0.2335633 0.0000303 -0.622128 0.2516875 -0.0001529 0.0002539 -0.0003155 -0.0961114 0.8295998 -0.1784666 0.0003872 0.0369784 -0.0804966 -0.0000066 0.0000972 0.0002014 0.0465032 1.1344227 0.113182 -0.0000698 -0.0107397 0.0284135 0.0000803 -0.0000682 0.0000412 0.0863536 -0.2286671 0.0022452 0.0000317 0.199526 -0.0906877 -0.0000456 -0.000058 -0.0000379 -0.130826 0.0251687 -0.0828566 0.0000164 0.1788947 0.1037066 -0.000086 0.0000895 -0.0001768 -0.1400221 -0.2436417 0.0303486 -0.0000017 -0.2247969 0.0455761 -0.0001998 0.0001667 -0.0001063 -0.2255834 2.0183767 -0.1573956 0.0015784 -0.5617344 1.1303893 -0.0011071 0.0034151 -0.0014861 0.0971115 1.5584486 0.1356818 0.0002714 1.1484816 1.3321586 -0.0006186 0.0005703 -0.0006644 0.1639129 -0.4946729 0.0623816 -0.0002191 0.1813999 -0.0364211 0.0004317 -0.0015251 0.0004164 0.060569 0.2071418 -0.0070777 0.0000155 0.0140596 0.0760542 0.0000601 0.0000088 0.0000535 0.1863216 0.0472037 -0.0746076 0.0000278 -0.0514575 -0.0361711 0.0000982 -0.0000063 0.000126 0.1656341 -0.029769 0.1341503 -0.0000836 0.1150158 -0.0376264 0.0001204 -0.0000994 0.0000988 0.169556 0.1570586 -0.0076894 0.0000121 0.0506936 0.1009499 0.0000995 0.0000329 0.0000608 0.3026001 0.0322351 0.0053497 0.0008758 0.0471805 0.041375 0.1110501 -0.0565872 0.1017147 -0.0345761 0.0318239 -0.0447615 0.0002513 -0.1217311 -0.0169548 0.0005707 0.0007636 0.0004634 0.1308937 0.0324966 0.005216 -0.0011106 0.0475723 0.0397056 -0.1118638 0.0564393 -0.1024448 -0.0332764 0.2588466 -0.0620524 0.0003595 -0.121318 0.1848269 -0.0000504 0.002304 -0.0009773 0.4029819 0.2740392 -0.0094841 0.0004205 0.0777288 0.1488396 0.0008973 0.0031257 0.0003854 0.4047531 unknown
polarizability: 243.8407655|-13.6998212|145.6983735|0.0318933|-0.055725|58.2373874 unknown
InChI: InChI=1S/C9H9N3OS/c1-5(13)11-6-2-3-7-8(4-6)14-9(10)12-7/h2-4,11H,10H2,1H3
charge 0 multiplicity 1
23 atoms
S  -2.156358 1.845429 -0.001294
O  3.142327 1.735571 -0.001242
N  2.657924 -0.562291 -0.000066
N  -3.009855 -0.734569 -0.00021
N  -4.786004 0.865692 -0.002464
C  -0.934279 0.494853 -0.000527
C  -1.602629 -0.774221 -0.000021
C  1.231475 -0.569533 -0.000064
C  0.462104 0.625721 -0.0007
C  -0.814652 -1.947976 0.000566
C  0.587055 -1.84129 0.000626
C  -3.460682 0.504067 -0.000621
C  3.529158 0.529247 -0.000569
C  5.007678 0.135835 0.000128
H  0.971973 1.589973 -0.00124
H  -1.309071 -2.923335 0.001012
H  1.194284 -2.755641 0.001144
H  3.095291 -1.486912 0.000411
H  5.267069 -0.45612 0.897702
H  5.612545 1.053749 -0.003242
H  5.266564 -0.462521 -0.89333
H  -5.077685 1.838289 -0.001331
H  -5.485833 0.126583 0.00323
