program: Gaussian 09
title: 000231933
version: EM64L-G09RevD.01
frameworkgroup: C1[X(C15H17NO3)]
method: RPBEPBE
basis: SDD
operation: Freq
keyword: #p
keyword: freq=noraman
keyword: PBEPBE/SDD
title: #p freq=noraman PBEPBE/SDD
converged: YES YES NO NO
title: Mulliken charges:
elementType: O O O N C C C C C C C C C C C C C C C H H H H H H H H H H H H H H H H H
charge: -0.399242 -0.209648 -0.153832 -0.278411 -0.470766 0.137562 -0.316141 -0.305514 -0.013567 0.353639 -0.169881 0.291267 -0.183818 -0.681398 -0.701168 -0.398761 -0.374234 -0.230089 -0.236429 0.277048 0.250596 0.237016 0.227331 0.245518 0.232602 0.254123 0.246129 0.226872 0.224496 0.242515 0.235998 0.290506 0.287517 0.234208 0.236335 0.391622
chargesum: 0.00000
title: Mulliken charges with hydrogens summed into heavy atoms:
elementType: O O O N C C C C C C C C C C C C C C C
charge: -0.399242 -0.209648 -0.153832 0.113211 0.056878 0.137562 0.148207 0.172606 -0.013567 0.353639 -0.169881 0.291267 -0.183818 0.045726 0.001841 -0.108255 -0.086717 0.004119 -0.000094
polarizability: 2.39882614e+02 1.05185502e+01 2.12581386e+02 -8.10676089e+00 -4.08693968e+00 1.05106578e+02
1716.lowfreq: -9.9581 -5.5888 -0.0005 0.0004 0.0004 9.2194 23.7209 46.1667 59.0969
frequency: 23.1858 46.0446 59.0448 65.5091 108.1589 118.9259 134.8952 148.9716 183.8229 200.9948 220.8017 255.6202 267.8235 273.9948 280.8871 304.7281 352.4962 374.9558 396.7579 407.9466 418.6070 448.6904 451.9447 483.4988 499.0074 525.2818 552.9660 626.5567 658.3260 679.8926 702.5268 738.2774 780.0341 796.2645 802.4926 831.4815 857.0122 871.8066 889.8451 925.9726 933.8321 950.2889 966.5878 991.3337 998.4527 1009.5153 1017.0430 1037.9792 1061.7644 1065.3885 1084.1955 1087.5363 1121.4439 1158.0224 1168.3339 1179.1812 1186.8098 1219.7309 1230.8685 1272.3055 1280.8024 1302.8123 1312.6073 1345.7427 1369.0227 1388.8609 1396.1903 1404.2015 1410.8215 1424.8277 1439.4925 1462.1127 1470.8840 1472.4254 1478.0964 1481.2870 1484.6161 1487.3840 1497.0137 1516.4297 1543.1204 1568.1538 1575.7782 1600.2994 1614.2400 1813.3884 2983.8573 2986.1514 2993.6064 2995.0258 3001.3091 3046.0036 3060.6869 3067.3727 3091.6553 3094.8089 3100.5408 3112.3620 3132.6847 3147.7831 3161.1020 3171.7864
redmass: 4.1032 4.1327 3.3544 6.2357 3.3996 1.8375 3.0140 4.1601 5.5272 3.1538 1.7037 1.2718 3.6956 2.2631 2.7840 3.2331 10.9716 4.6433 4.3395 2.9715 3.7148 4.5587 7.2477 5.2855 3.9717 4.9351 4.8988 6.6768 6.3054 4.1138 6.4627 3.0024 1.5846 1.6402 1.2770 1.6816 2.6757 2.7665 2.1610 2.3183 2.1610 4.3127 3.1406 1.4010 1.7525 1.3691 2.4819 1.9839 3.3959 2.4502 2.2636 1.7309 2.0928 1.7005 1.1250 1.9251 2.3724 2.5882 1.5407 1.7031 1.1362 1.7311 1.3893 1.8447 1.3294 3.4975 3.8035 1.2650 1.2192 1.8419 2.2926 1.0853 1.1022 1.0824 1.0764 1.3077 1.4491 1.1405 1.2923 8.0377 2.4443 2.7535 2.4335 4.8583 7.8167 1.0729 1.0648 1.0617 1.0626 1.0367 1.0369 1.1017 1.1010 1.0986 1.0987 1.0992 1.1014 1.1014 1.0860 1.0906 1.0955 1.0985
irintensity: 0.1380 1.8792 0.9095 1.4359 3.9632 0.4771 2.4447 7.0950 4.3151 3.0118 3.0030 0.3383 0.3126 0.1023 2.2608 8.0873 1.6658 5.6965 14.8182 1.1870 0.8291 9.0830 2.2280 485.7079 1.2388 3.0398 12.9801 0.7560 6.6936 23.5256 8.4406 24.4252 16.1905 45.8378 3.8533 183.4464 2.5433 111.6555 125.6957 435.7171 169.3850 191.9216 30.1680 8.6080 556.0126 4.6081 139.9521 2.5240 154.7498 17.1026 3.6170 7.2362 14.5745 16.8125 9.2946 98.5512 30.4371 42.1833 53.3003 11.7759 1.6175 61.4778 16.7379 24.4296 6.1473 35.3926 47.1948 16.2219 22.2989 53.9742 53.7862 3.1216 11.8258 7.4170 17.3892 13.9283 8.2485 14.9786 97.3986 173.2093 253.1207 87.8617 219.1185 89.5995 24.5985 78.4286 25.6200 5.5647 48.8120 13.3045 11.9981 7.4223 5.8632 10.1331 24.0348 26.5207 41.4157 20.5424 4.3232 7.5167 12.6097 19.9349
temp: 298.150 k
press: 1.00000 atm
elementType: 8 8 8 7 6 6 6 6 6 6 6 6 6 6 6 6 6 6 6 1 1 1 1 1 1 1 1 1 1 1 1 1 1 1 1 1
symmnumber: 1
zpe: 758396.6 jmol-1
zpe.correction: 0.288858 hartree
zpe.thermalcorrener: 0.306557 hartree
zpe.thermalcorrenthalpy: 0.307501 hartree
zpe.thermalcorrgfe: 0.242703 hartree
zpe.sumelectzpe: -860.821569 hartree
zpe.sumelectthermal: -860.803870 hartree
zpe.sumelectthermalent: -860.802925 hartree
zpe.sumelectthermalfe: -860.867723 hartree
dipole: 7.0195 -5.6516 0.7906
dipole: 9.0465
quadrupole: -82.8418 -133.3023 -108.7427
quadrupole: 13.1869 -1.6226 1.8430
quadrupole: 25.4538 -25.0067 -0.4471 13.1869 -1.6226 1.8430
hfenergy: -861.1104265 hartree
pointgroup: C01 [X(C15H17N1O3)]
dipole: 1.936948 -1.1891272 2.7389669 debye
polarizability: 235.1977253|-31.464386|126.3340027|-12.8887967|-32.7589207|196.0388491 unknown
InChI: InChI=1S/C15H17NO3/c1-3-16(4-2)9-12-13(17)10-7-5-6-8-11(10)14(18)15(12)19/h5-8,16H,3-4,9H2,1-2H3
charge 0 multiplicity 1
36 atoms
O  0.401257 -1.007861 1.246204
O  0.978087 0.526868 -3.261694
O  -1.700875 1.417456 -3.274738
N  2.725774 -0.984766 0.341988
C  2.147782 -0.793988 -1.065463
C  0.718721 -0.276867 -1.022486
C  3.545496 0.207914 0.79135
C  3.494367 -2.28682 0.442502
C  -0.088744 -0.458931 0.120922
C  -1.510854 -0.028264 0.118561
C  0.236737 0.357692 -2.228677
C  -2.070612 0.598698 -1.033045
C  -1.235023 0.840812 -2.252238
C  2.758585 1.528085 0.794352
C  3.931738 -2.635526 1.873973
C  -2.316363 -0.241442 1.261376
C  -3.428014 1.001006 -1.024303
C  -3.670086 0.160878 1.260408
C  -4.228466 0.783049 0.116922
H  2.786555 -0.113036 -1.656802
H  2.185402 -1.776299 -1.574915
H  3.899238 -0.010007 1.813406
H  4.430457 0.278943 0.127314
H  2.815108 -3.071839 0.065686
H  4.364199 -2.235426 -0.242019
H  2.424583 1.819335 -0.214788
H  1.872448 1.464613 1.448696
H  3.412953 2.330356 1.17932
H  4.730409 -1.975135 2.251908
H  3.077003 -2.594163 2.572676
H  4.325964 -3.666947 1.886615
H  -1.862327 -0.72309 2.132204
H  -3.829813 1.482109 -1.922262
H  -4.290242 -0.009319 2.147367
H  -5.278359 1.094973 0.119157
H  1.71292 -1.068558 0.975923
