program: Gaussian 09
title: 000231880
version: EM64L-G09RevD.01
frameworkgroup: C1[X(C3H7N3O2)]
method: RPBEPBE
basis: SDD
operation: Freq
keyword: #pfreq=noraman
keyword: PBEPBE/SDD
title: #p freq=noraman PBEPBE/SDD
converged: YES YES NO NO
title: Mulliken charges:
elementType: O O N N N C C C H H H H H H H
charge: -0.241067 -0.230884 -0.402293 -0.484856 -0.642626 0.332465 -0.596965 0.286546 0.297948 0.297494 0.278590 0.223023 0.230021 0.308596 0.344008
chargesum: 0.00000
title: Mulliken charges with hydrogens summed into heavy atoms:
elementType: O O N N N C C C
charge: -0.241067 -0.230884 -0.104345 -0.187362 0.009978 0.332465 0.134669 0.286546
polarizability: 8.47634731e+01 -8.40072229e-01 6.11156031e+01 2.36307808e+00 9.71097212e-01 3.94049976e+01
1716.lowfreq: -11.2761 -7.6950 -0.0009 -0.0005 0.0005 0.9892 56.0234 79.2495 90.7464
frequency: 55.9478 79.2138 90.6612 136.6629 195.4631 290.2450 356.1121 386.8770 444.7513 482.2948 526.2586 551.3400 572.2248 664.1252 721.8982 753.6617 907.8580 952.1173 1051.8273 1119.7542 1125.5072 1136.3149 1194.2077 1298.0789 1423.5169 1431.8441 1453.8532 1484.7371 1509.8852 1604.1153 1658.1353 1701.2678 2978.3886 3057.3728 3112.6329 3526.0090 3532.2503 3554.6743 3684.0697
redmass: 4.2973 2.4552 1.3645 4.0563 4.3107 4.6963 2.6013 1.8273 2.3662 1.2065 1.1836 1.1974 3.3216 6.8620 8.7222 4.6447 4.5202 4.3746 1.8833 3.3033 1.3102 1.6035 2.0200 2.6981 1.1723 2.2629 1.3616 1.0618 1.3171 1.2177 4.9030 7.5392 1.0355 1.1024 1.0979 1.0643 1.0577 1.0773 1.1037
irintensity: 4.4568 2.8640 0.5826 1.7676 3.4076 7.0911 7.9343 14.2690 63.7840 107.5332 298.2464 119.8418 12.2099 9.2737 66.1241 5.0064 5.7902 7.3973 33.1625 49.3973 0.9210 36.7549 341.0913 52.0207 40.7523 577.3890 98.9250 23.3814 125.1145 53.5969 128.9767 423.5447 72.6189 40.7029 2.3033 12.0312 31.4782 17.2480 31.8672
temp: 298.150 k
press: 1.00000 atm
elementType: 8 8 7 7 7 6 6 6 1 1 1 1 1 1 1
symmnumber: 1
zpe: 303888.3 jmol-1
zpe.correction: 0.115745 hartree
zpe.thermalcorrener: 0.124932 hartree
zpe.thermalcorrenthalpy: 0.125877 hartree
zpe.thermalcorrgfe: 0.081127 hartree
zpe.sumelectzpe: -432.619894 hartree
zpe.sumelectthermal: -432.610707 hartree
zpe.sumelectthermalent: -432.609763 hartree
zpe.sumelectthermalfe: -432.654512 hartree
dipole: 0.5719 -7.1709 -0.1900
dipole: 7.1962
quadrupole: -33.1940 -48.5909 -48.4686
quadrupole: 4.3491 6.7126 0.6311
quadrupole: 10.2239 -5.1730 -5.0508 4.3491 6.7126 0.6311
hfenergy: -432.7356391 hartree
pointgroup: C01 [X(C3H7N3O2)]
dipole: 0.3021416 -2.8031343 -0.2584668 debye
dipolederiv: -0.6549642 -0.0457644 -0.0220226 -0.0494091 -0.8958581 0.2435043 -0.1056972 0.2344214 -0.4318504 -0.6842914 0.0942615 0.0346431 0.1992624 -0.8274965 -0.3019681 0.0057686 -0.3097783 -0.5115105 -1.213193 0.245108 -0.1216602 0.3501294 -0.5612949 -0.0676492 -0.08618 -0.0945435 -0.4560952 -1.9531345 -0.0834559 0.1159335 -0.0933791 -0.3827782 0.0096469 0.21043 0.0149873 -0.5286541 -1.0101098 -0.3985994 -0.2178786 -0.4643959 -0.8020894 0.1077111 -0.1845376 0.1423182 -0.5808108 2.2024632 -0.0554294 0.1061492 0.1415321 1.2820617 -0.4637033 0.2736414 -0.3873364 0.4608608 0.5144845 0.0119503 0.0026289 0.2078789 0.0755688 0.1192361 -0.0947248 0.128303 0.2095263 2.2683927 0.1631034 0.0289968 -0.2392843 1.2381339 0.5777501 0.0676931 0.5250163 0.6205242 0.111442 -0.0399073 0.0205564 -0.0888068 0.1698532 0.1173457 -0.0013974 0.1396739 0.2767796 0.0660131 0.0060833 0.0510443 0.0101071 0.0666554 -0.0230105 -0.0714721 -0.0249023 0.3551106 0.159031 0.0464657 -0.0316459 -0.0614753 0.0263768 0.0715344 0.0191748 0.0652022 0.0902026 -0.1078271 0.0626278 0.0632925 0.1015848 -0.0026096 -0.1150016 0.1077851 -0.1024544 0.0378577 -0.0817696 -0.0194973 -0.0695592 -0.062749 0.1139297 -0.0400257 -0.1352176 -0.053575 -0.109168 0.1851318 0.000604 0.030619 0.042601 0.2564058 -0.1295448 0.0012215 -0.1669911 0.2498218 0.1983315 0.0124496 0.0089029 0.0064039 0.2431413 -0.1058255 -0.0064877 -0.1103413 0.3174054 unknown
polarizability: 84.9089906|-0.0659188|60.8879541|-0.3760523|2.3214653|39.4871291 unknown
InChI: InChI=1S/C3H7N3O2/c1-5-3(8)6-2(4)7/h5-6H,4H2,1H3
charge 0 multiplicity 1
15 atoms
O  0.828236 1.200153 -0.57652
O  -1.859053 0.939489 0.854503
N  1.919964 -0.737882 0.161379
N  -0.415456 -0.738106 -0.0018
N  -2.741022 -0.994795 -0.112176
C  0.790288 0.017148 -0.155631
C  3.270489 -0.200146 -0.038196
C  -1.68852 -0.161322 0.277488
H  1.810213 -1.589716 0.713106
H  -0.360962 -1.75476 -0.094699
H  3.172285 0.746201 -0.593334
H  3.896037 -0.900651 -0.620932
H  3.770204 0.015605 0.924974
H  -2.634167 -1.721274 -0.818115
H  -3.679833 -0.683044 0.128354
