program: Gaussian 09
title: 000231879
version: EM64L-G09RevD.01
frameworkgroup: C1[X(C5H11N3O2)]
method: RPBEPBE
basis: SDD
operation: Freq
keyword: #p
keyword: freq=noraman
keyword: PBEPBE/SDD
title: #p freq=noraman PBEPBE/SDD
converged: YES YES NO NO
title: Mulliken charges:
elementType: O O N N N C C C C C H H H H H H H H H H H
charge: -0.235731 -0.232340 -0.393781 -0.492343 -0.642499 -0.339867 -0.340785 -0.677028 0.314620 0.277784 0.245376 0.206657 0.183393 0.241819 0.288678 0.219653 0.202775 0.223051 0.298010 0.308663 0.343895
chargesum: 0.00000
title: Mulliken charges with hydrogens summed into heavy atoms:
elementType: O O N N N C C C C C
charge: -0.235731 -0.232340 -0.105103 -0.194333 0.010059 0.112166 0.084427 -0.031549 0.314620 0.277784
polarizability: 1.14438600e+02 -1.61727402e-01 7.84577937e+01 1.67132660e+00 2.73045548e+00 5.91883384e+01
1716.lowfreq: -10.6305 -6.8469 -0.0009 -0.0009 -0.0007 6.1337 31.9519 47.4406 61.8643
frequency: 31.5346 47.4146 61.7113 69.7368 117.9886 162.8842 220.0490 272.9820 283.1037 311.6390 371.3579 435.7245 484.5612 493.3096 514.5240 551.0619 587.9570 662.7591 720.7468 724.0064 767.3444 871.7038 883.9831 918.8394 973.1631 1047.5523 1052.6760 1110.7639 1117.1671 1148.0416 1190.5791 1246.9721 1295.6384 1300.4116 1311.2872 1365.8658 1390.7274 1429.7106 1451.4695 1472.9642 1475.9514 1482.4488 1485.7179 1604.4295 1654.5373 1698.8103 2975.6851 2980.2173 2993.3160 3040.2854 3067.7069 3080.1610 3082.6857 3526.6214 3533.2388 3542.2325 3685.5929
redmass: 3.2941 5.1258 3.0051 2.6467 3.9109 5.4516 1.1166 2.7658 4.8304 3.0275 1.6450 1.8686 1.4733 2.4017 1.3304 1.1955 3.2689 6.0394 5.7348 1.8798 1.7450 1.5586 1.9239 3.0054 3.8686 3.0714 1.8848 2.2266 3.2033 1.7236 2.0241 1.2885 2.0305 1.1660 1.4381 1.3659 1.2096 2.3347 1.1097 1.1156 1.2507 1.2299 1.1159 1.2259 4.9811 7.3599 1.0364 1.0628 1.0652 1.0955 1.0992 1.1002 1.1017 1.0676 1.0548 1.0767 1.1037
irintensity: 6.9423 4.2889 2.2305 2.3584 0.8259 1.8946 0.1409 1.0565 2.8127 5.0814 10.6010 59.0811 82.4577 81.3623 240.0734 131.8873 2.1811 8.5082 49.2108 24.3050 6.1269 7.4196 10.5224 3.5645 2.6387 0.3742 43.4423 14.1647 14.9658 3.6355 389.4498 53.1316 44.0248 10.2864 1.9457 3.9086 14.0969 582.1238 50.7935 16.8783 140.2484 79.3271 41.8639 55.5676 139.1505 394.0511 37.6022 22.9381 57.4766 2.5246 17.4632 41.2434 55.7153 8.3858 38.0082 14.6378 31.7143
temp: 298.150 k
press: 1.00000 atm
elementType: 8 8 7 7 7 6 6 6 6 6 1 1 1 1 1 1 1 1 1 1 1
symmnumber: 1
zpe: 450881.8 jmol-1
zpe.correction: 0.171732 hartree
zpe.thermalcorrener: 0.183571 hartree
zpe.thermalcorrenthalpy: 0.184516 hartree
zpe.thermalcorrgfe: 0.132451 hartree
zpe.sumelectzpe: -511.069603 hartree
zpe.sumelectthermal: -511.057763 hartree
zpe.sumelectthermalent: -511.056819 hartree
zpe.sumelectthermalfe: -511.108883 hartree
dipole: -0.1874 -6.6946 -1.5848
dipole: 6.8821
quadrupole: -42.7208 -60.9845 -63.1236
quadrupole: 10.7141 -2.3624 0.1029
quadrupole: 12.8889 -5.3749 -7.5140 10.7141 -2.3624 0.1029
hfenergy: -511.2413343 hartree
pointgroup: C01 [X(C5H11N3O2)]
dipole: 0.024218 -2.6509615 0.5505983 debye
dipolederiv: -0.7091912 -0.0423953 -0.0178153 -0.0065821 -0.8882478 -0.204282 0.0894519 -0.1823945 -0.3599089 -0.6773891 0.0219842 -0.0210544 0.1517037 -0.7509997 0.3522379 -0.0206735 0.346385 -0.5994464 -1.3044503 0.196398 0.0847651 0.4127648 -0.5870788 0.1381498 0.0179279 0.2096559 -0.4272483 -1.9718538 0.0083717 -0.2719067 0.0291355 -0.3766706 -0.0174753 -0.4274856 -0.0212053 -0.5838698 -1.1796694 -0.3262453 0.1819706 -0.3994553 -0.7581638 -0.1571736 0.1460367 -0.1797861 -0.4841229 0.6368212 0.0052556 0.0008247 0.1686639 0.1925398 -0.0667179 0.0984986 -0.134502 0.2324373 -0.0395938 -0.0102969 -0.0229648 -0.05444 0.1264942 0.0506646 -0.0319583 0.0981747 0.0427074 -0.0451352 -0.0500485 0.0003838 -0.0739095 0.0833131 -0.007254 0.0688367 -0.01277 0.0516962 2.3584974 -0.1180311 0.1519224 -0.0594407 1.2872425 0.3889058 -0.0277989 0.2609634 0.3408633 2.3221752 0.1636283 0.0932221 -0.281371 1.0673893 -0.6598032 0.1554727 -0.5606002 0.77598 0.0744044 0.0136819 0.0334012 -0.0545097 0.0156963 -0.1042267 0.0101703 -0.0490686 -0.0004615 -0.0924463 0.076722 -0.0596356 0.0799667 -0.0603339 0.1228581 -0.0442355 0.0890814 0.0215168 0.0418597 -0.0323731 0.0078935 -0.0234669 -0.0900605 -0.1556211 0.0131966 -0.1112864 -0.0655254 -0.0026189 0.0718343 -0.0583591 0.0673074 -0.0225818 0.0830771 -0.0452827 0.0545672 0.0281416 0.1044853 0.0058586 -0.0344926 -0.0487911 0.1634244 -0.1030224 -0.0429315 -0.1542259 0.2559927 0.0708601 0.0261125 0.0172264 -0.0129764 -0.0463479 -0.1275278 -0.0339305 -0.1408772 -0.0263604 -0.0103405 0.0673146 -0.0589271 0.1321278 -0.0732447 0.0904786 -0.0995555 0.0768232 0.0433145 -0.0428884 -0.0529101 0.0966276 -0.073504 0.070952 0.0666404 0.1302522 0.0768583 -0.071148 0.0700457 -0.0076899 -0.0864965 0.0165466 0.0826637 0.0669712 0.0364452 0.0590251 0.3345868 0.19539 -0.0169042 -0.023066 0.034664 0.2924473 0.130061 0.0041586 0.1583877 0.2064134 0.201038 -0.0002673 -0.0135193 -0.0044336 0.271567 0.1130593 0.0034045 0.1167944 0.2844417 unknown
polarizability: 114.1382886|2.3746763|77.2222775|3.6013486|-5.4843717|60.7241656 unknown
InChI: InChI=1S/C5H11N3O2/c1-2-3-7-5(10)8-4(6)9/h7-8H,2-3,6H2,1H3
charge 0 multiplicity 1
21 atoms
O  -0.052928 1.104859 0.605668
O  -2.522306 0.887862 -1.19366
N  0.916997 -0.998929 0.263546
N  -1.407429 -0.77325 0.080161
N  -3.740432 -0.799808 -0.13558
C  2.283498 -0.540597 0.569975
C  3.059205 -0.041719 -0.672186
C  4.48117 0.4307 -0.302329
C  -0.158565 -0.113971 0.318723
C  -2.557354 -0.1307 -0.46153
H  2.190397 0.284464 1.297711
H  2.834799 -1.367972 1.058213
H  3.11584 -0.853102 -1.425971
H  2.488327 0.78733 -1.129846
H  0.80696 -1.881991 -0.238423
H  4.443695 1.260779 0.427388
H  5.075016 -0.388476 0.146544
H  5.024755 0.791224 -1.193695
H  -1.476344 -1.765826 0.315264
H  -3.814474 -1.42884 0.661941
H  -4.595625 -0.440737 -0.555013
