program: Gaussian 09
title: 000231881
version: EM64L-G09RevD.01
frameworkgroup: C1[X(C11H11NO3)]
method: RPBEPBE
basis: SDD
operation: Freq
keyword: #p
keyword: freq=noraman
keyword: PBEPBE/SDD
title: #p freq=noraman PBEPBE/SDD
converged: YES YES NO NO
title: Mulliken charges:
elementType: O O O N C C C C C C C C C C C H H H H H H H H H H H
charge: -0.230026 -0.231039 -0.289846 0.010401 0.485995 -0.222375 -0.397061 -0.362678 -0.224977 -0.218364 -0.230454 -0.272074 0.340953 -0.180997 -0.659961 0.288837 0.264293 0.252061 0.233484 0.234041 0.234999 0.236083 0.232789 0.221884 0.236520 0.247513
chargesum: 0.00000
title: Mulliken charges with hydrogens summed into heavy atoms:
elementType: O O O N C C C C C C C C C C C
charge: -0.230026 -0.231039 -0.289846 0.010401 0.485995 0.066463 -0.132768 -0.110617 0.008507 0.015677 0.004545 0.196798 0.340953 -0.180997 0.045956
polarizability: 1.57016798e+02 5.29692238e+00 1.38009204e+02 1.26485431e+01 -1.15383394e+01 9.62235337e+01
1716.lowfreq: -14.7927 -6.2453 -0.0010 -0.0010 -0.0006 5.0069 27.9642 38.3054 49.8193
frequency: 27.6535 37.9709 49.6032 81.2252 84.3968 110.0940 116.0744 177.1453 195.7936 238.7158 277.6945 312.1609 340.0852 358.4937 402.5263 418.7748 453.9557 511.4602 580.6096 614.7638 629.0006 665.7531 692.2087 702.8342 766.1260 788.0341 813.4971 835.4441 854.5562 858.3292 937.0757 950.4666 983.4070 988.1883 999.1005 1004.3114 1028.5897 1036.2570 1090.4283 1096.6723 1158.9146 1176.7129 1180.0332 1196.8297 1204.8920 1278.2523 1281.0864 1285.4057 1346.4004 1358.4582 1388.7912 1395.6345 1447.1948 1457.9620 1464.7307 1483.8148 1484.2988 1595.4875 1612.1618 1616.6309 2209.2518 2995.6919 3022.8397 3034.9545 3090.7427 3099.8477 3126.8072 3130.1553 3135.5295 3144.7893 3156.0054 3169.8121
redmass: 4.6002 4.0846 3.5457 6.5091 5.0112 6.1315 5.1863 4.4300 2.4900 1.8037 4.1751 3.6916 6.1520 4.9237 2.8094 5.9572 4.6467 4.8344 5.5164 6.4512 6.9886 5.9982 10.4564 1.8193 2.0681 2.2976 1.5637 4.9157 4.7076 1.2787 1.5164 2.9149 1.5720 3.6899 3.6843 1.4310 2.1939 4.5562 1.6308 2.1713 1.7447 1.0726 3.5589 1.1957 2.2809 1.1186 1.6544 1.2736 1.2898 1.2738 6.9455 1.2308 2.1577 1.1004 1.0458 1.8621 1.1613 6.1121 5.9798 8.7283 12.5978 1.0363 1.0829 1.0608 1.0975 1.1020 1.1067 1.0853 1.0884 1.0927 1.0967 1.1017
irintensity: 0.5980 0.3934 0.6606 2.7123 0.1691 2.0159 1.5451 1.8708 5.4187 4.0677 7.6763 11.9500 11.1925 4.5810 0.1692 5.0343 1.7334 8.0703 9.9450 0.2482 11.3144 3.6226 17.7855 58.0932 105.6609 12.7018 14.1272 92.5922 30.7190 2.2020 2.5140 70.6203 3.4762 44.4228 68.9720 7.2829 9.1642 1.2043 8.7499 33.5453 81.6260 14.9169 763.7340 22.0021 84.2632 2.7573 12.9318 40.4090 2.1541 6.2817 1.4644 25.7823 13.2884 18.5046 14.2320 9.9743 11.7871 5.6195 6.8802 172.0112 0.3890 15.3160 15.3935 24.7979 28.1990 3.5204 28.2472 0.3193 0.8880 10.4131 21.3904 19.1047
temp: 298.150 k
press: 1.00000 atm
elementType: 8 8 8 7 6 6 6 6 6 6 6 6 6 6 6 1 1 1 1 1 1 1 1 1 1 1
symmnumber: 1
zpe: 519416.1 jmol-1
zpe.correction: 0.197835 hartree
zpe.thermalcorrener: 0.212342 hartree
zpe.thermalcorrenthalpy: 0.213286 hartree
zpe.thermalcorrgfe: 0.154194 hartree
zpe.sumelectzpe: -705.074985 hartree
zpe.sumelectthermal: -705.060478 hartree
zpe.sumelectthermalent: -705.059534 hartree
zpe.sumelectthermalfe: -705.118626 hartree
dipole: 0.8953 -4.4276 0.1257
dipole: 4.5190
quadrupole: -66.2850 -97.2261 -88.3228
quadrupole: 3.2456 2.0197 0.5439
quadrupole: 17.6597 -13.2815 -4.3782 3.2456 2.0197 0.5439
hfenergy: -705.2728202 hartree
pointgroup: C01 [X(C11H11N1O3)]
dipole: -0.1855246 -0.6437472 -1.6468615 debye
dipolederiv: -1.602291 -0.1601482 -0.4079165 -0.3802189 -0.3475893 -0.1092612 -0.7905545 -0.1791139 -0.8108984 -1.512534 -0.4224411 -0.3066084 -0.8580704 -0.713807 -0.1554544 -0.3145037 -0.0289333 -0.4168624 -0.7487597 -0.1224205 -0.1437247 -0.2040583 -0.653277 0.2142345 -0.1764196 0.2381569 -0.6802784 -0.182905 -0.0127248 -0.0069897 0.026875 -0.2225863 -0.0114653 0.0366825 -0.0326085 -0.2045872 -0.1033704 -0.0483557 -0.0553303 0.0577358 -0.1299539 -0.1428468 0.0444624 -0.0482309 -0.0854838 1.2314133 0.0386353 -0.0088056 0.3715916 0.5939719 0.3536489 -0.1680738 0.1491229 0.4635479 -0.0191232 -0.0841805 0.0679327 -0.03662 -0.10436 -0.0633648 -0.0564909 0.0103422 -0.0189145 -0.0506063 -0.010942 -0.070183 -0.0487706 -0.0926824 0.0111046 0.0556194 -0.0439845 0.0402587 -0.1538643 0.008427 -0.0278059 0.0077611 -0.1286463 -0.0270667 -0.0543264 -0.0515308 0.130242 -0.0148829 -0.1099837 0.1036998 -0.1068398 -0.0566688 -0.0764798 0.1157037 -0.0711054 -0.0564193 0.0377539 -0.1062015 -0.0706442 -0.0956287 -0.0777371 0.0110706 -0.06331 0.0052053 -0.001213 0.9343766 0.1055272 0.2027021 0.0491233 0.3217921 0.0386201 0.4265505 0.1606023 0.4074272 2.123598 0.6143617 0.6279799 0.9611445 1.070856 -0.1682914 0.9484809 -0.206906 1.1347995 -0.1253155 0.0212362 0.0593447 -0.059781 -0.0274714 0.0258231 -0.0055543 0.0013015 -0.005725 -0.1753064 0.0621241 -0.0158074 0.0926251 -0.0521825 -0.0145403 -0.0628143 -0.0754346 0.0065846 0.0604975 0.0301934 0.0125069 -0.0482738 0.0071488 -0.0493251 0.0425023 0.0643959 0.0660138 0.066397 0.0904763 -0.0601881 0.0898808 0.0904234 0.035495 -0.0514132 0.0310095 0.0737736 0.1178547 0.0140912 0.0368348 0.0094215 0.1343258 0.0188407 0.0327284 0.0191774 -0.0484301 0.0924112 0.0310169 0.0348517 0.0296374 0.1304769 0.0385959 0.0533268 0.0345888 -0.101858 0.005975 0.1005658 -0.0520676 0.1085784 0.0798793 0.0570931 -0.0644394 0.0654447 0.0348334 -0.0317545 0.0929776 0.0830254 0.0994932 0.1063495 -0.0290991 0.0859213 -0.0274536 0.050819 -0.0444184 -0.0047112 0.076424 0.0207763 0.0909269 0.0560961 -0.0078122 -0.0309636 -0.0825157 -0.0076963 -0.0366232 -0.0361589 -0.0449225 -0.1162616 -0.0230993 -0.046365 0.0139151 0.0855298 -0.0831501 -0.0264238 -0.1225868 -0.002925 0.1132929 -0.0341869 -0.1296523 -0.0328404 0.0009849 0.0843032 0.0135115 0.0597419 0.002328 0.0769047 0.0497217 0.1157686 0.0307765 -0.0829333 0.1013976 -0.0779881 0.0197733 -0.040863 -0.0931247 -0.0058633 0.0339825 0.0050665 0.1013043 unknown
polarizability: 157.898498|-11.7741432|93.2881829|1.3154469|5.881776|140.0628546 unknown
InChI: InChI=1S/C11H11NO3/c1-2-14-11(13)15-10(8-12)9-6-4-3-5-7-9/h3-7,10H,2H2,1H3
charge 0 multiplicity 1
26 atoms
O  -0.938974 -0.37306 1.111547
O  -2.708622 -1.342584 0.17261
O  -1.775314 0.532442 -0.896814
N  0.519045 1.455528 3.581108
C  1.413365 0.083605 0.414528
C  0.166709 0.665671 1.061189
C  1.613376 0.277412 -0.975464
C  2.351195 -0.667823 1.164681
C  2.744077 -0.280844 -1.610108
C  3.480109 -1.224641 0.527044
C  3.678974 -1.032194 -0.86046
C  -3.787726 -1.41189 -0.870679
C  -1.815006 -0.312435 0.02943
C  0.356916 1.087996 2.459226
C  -4.937185 -0.464381 -0.525392
H  -0.212864 1.515937 0.462569
H  0.880841 0.852016 -1.553745
H  2.200243 -0.812048 2.240706
H  2.896993 -0.128134 -2.683812
H  4.205024 -1.803269 1.109408
H  4.558237 -1.462058 -1.352926
H  -3.341276 -1.172892 -1.851773
H  -4.093048 -2.468964 -0.836067
H  -5.761797 -0.606874 -1.248174
H  -5.326507 -0.670858 0.486058
H  -4.612581 0.588343 -0.579391
