program: Gaussian 09
title: 000231902
version: EM64L-G09RevD.01
frameworkgroup: C1[X(C17H26N2O3)]
method: RPBEPBE
basis: SDD
operation: Freq
keyword: #p
keyword: freq=noraman
keyword: PBEPBE/SDD
title: #p freq=noraman PBEPBE/SDD
converged: NO YES NO NO
title: Mulliken charges:
elementType: O O O N N C C C C C C C C C C C C C C C C C H H H H H H H H H H H H H H H H H H H H H H H H H H
charge: -0.248030 -0.239605 -0.436959 -0.112053 -0.252384 -0.484136 -0.504437 -0.341741 -0.339030 -0.323438 -0.330485 0.328966 0.353002 -0.113472 -0.324889 -0.320364 -0.326332 -0.322590 -0.528763 -0.670336 0.485915 -0.826833 0.217454 0.238383 0.219882 0.236809 0.226136 0.196567 0.188431 0.209366 0.245547 0.216700 0.213893 0.224428 0.211702 0.189750 0.189901 0.211055 0.204609 0.225630 0.224313 0.199112 0.274698 0.237750 0.218609 0.229624 0.224242 0.403405
chargesum: 0.00000
title: Mulliken charges with hydrogens summed into heavy atoms:
elementType: O O O N N C C C C C C C C C C C C C C C C C
charge: -0.248030 -0.239605 -0.033554 -0.112053 -0.252384 -0.028300 -0.047746 0.080962 0.058767 0.138809 0.107837 0.328966 0.353002 -0.113472 0.076562 0.080592 0.103907 0.100835 -0.254065 -0.432586 0.485915 -0.154357
polarizability: 2.54245875e+02 -4.53327142e+00 2.05013233e+02 -2.32756252e+00 1.59386999e+01 1.62849366e+02
1716.lowfreq: -25.5857 -22.1669 -13.6120 -2.5330 -0.0009 -0.0007 -0.0005 4.1871 35.6940
frequency: -21.5664 -11.9430 35.0357 41.5917 49.9295 60.3924 69.8653 128.2048 142.6334 170.9649 180.1232 220.8196 222.5574 229.7865 249.5019 255.9182 281.5734 303.9664 308.5996 339.5855 353.0787 357.9862 398.5162 427.1489 440.8465 452.6559 460.9433 466.3044 468.0518 498.4151 541.0827 575.1290 597.0780 603.6161 613.1278 674.9414 747.7150 754.6344 778.3327 784.9039 805.4064 807.0565 840.3805 841.4906 876.9326 890.1692 894.0391 932.6916 948.8649 956.3911 983.3414 993.5021 998.1708 1004.3665 1021.9407 1024.7144 1027.7957 1048.1498 1048.5998 1053.4894 1075.5070 1082.9390 1094.3109 1104.8349 1106.8980 1114.1902 1126.7861 1142.2734 1145.9216 1146.8929 1187.9028 1194.1631 1211.0681 1212.0561 1222.9472 1236.7748 1263.0691 1265.1996 1278.0789 1281.3076 1291.2376 1293.7408 1312.7839 1318.9958 1326.5416 1337.3034 1339.5827 1351.3022 1353.9621 1362.2497 1369.2634 1371.1757 1372.8244 1385.4929 1398.8039 1428.7053 1442.6709 1447.1470 1449.2174 1449.6566 1450.8552 1453.7607 1457.0223 1457.4687 1460.9210 1468.5001 1469.5740 1473.5385 1479.2287 1515.7692 1619.7808 1628.3164 2485.6130 2857.4349 2866.4182 2903.9710 2925.0960 2932.0479 2938.4398 2949.5287 2953.7419 2954.0327 2959.8337 2970.3947 2987.9715 2995.7230 3022.1752 3037.2096 3040.6633 3046.8496 3056.1337 3075.4417 3077.3300 3080.8694 3087.5168 3092.0288 3102.5724 3123.2715
redmass: 3.6827 1.0855 3.5876 3.6999 4.3240 3.9187 3.5429 5.2290 4.2724 3.5396 3.9214 3.3649 3.1118 3.0373 2.0888 2.1067 2.9096 2.4291 2.2236 2.5861 4.4216 3.0845 1.9167 2.5131 5.3920 4.8755 4.9104 2.8879 3.0269 3.7847 3.5572 3.1366 3.0390 2.1742 2.5693 4.3939 3.9784 4.3425 4.0009 4.5476 3.7648 3.7318 1.5905 1.5972 1.3861 2.3456 2.3102 1.4237 2.7640 3.2658 2.2635 2.1999 2.0298 2.1441 2.1133 2.1185 2.1464 1.7290 1.5989 1.9628 3.0127 3.6846 2.6734 2.0273 1.8731 2.0450 2.6725 2.2400 2.3835 1.9496 1.0679 1.0802 1.4671 1.2985 1.4229 1.3489 1.3291 1.3341 1.4312 1.3379 1.2623 1.3458 2.1374 1.4077 1.7557 1.3394 1.2632 1.5229 1.4238 2.1840 1.2799 1.4942 1.3155 1.7726 1.2562 3.1623 1.0831 1.1237 1.0887 1.0844 1.0931 1.2278 1.2306 1.0964 1.1090 1.7919 1.0481 1.0972 1.1488 1.6071 4.5775 3.8549 1.0706 1.0706 1.0695 1.0673 1.0667 1.0654 1.0646 1.0667 1.0667 1.0669 1.0668 1.0372 1.0903 1.0996 1.0893 1.0891 1.0943 1.0975 1.0942 1.0987 1.0959 1.0974 1.0957 1.0971 1.0911 1.0910
irintensity: 0.1426 0.1807 0.3092 0.0912 0.2545 0.3654 0.3457 5.4403 10.3012 2.8632 4.9662 0.1613 1.9303 5.3076 1.5713 1.4064 0.0479 1.5595 10.4727 7.5413 1.7923 14.5449 0.3916 15.2897 3.1106 11.6509 3.4321 5.0117 1.0174 3.8488 8.6294 2.5189 6.3706 6.5419 2.2620 3.3831 12.9009 18.8595 17.4555 3.4494 42.2905 20.6549 0.5048 0.4343 26.1970 29.5337 9.7010 8.7867 2.6063 6.2725 29.8203 9.9777 6.3868 26.5060 13.8723 2.3474 9.5635 19.1844 23.3111 26.6099 30.0489 49.4384 27.4812 13.7099 24.7567 5.3608 73.7705 17.1271 13.7897 18.7544 2.0881 5.1458 19.3301 11.2184 27.4051 7.8985 17.9001 8.4229 30.9447 8.9935 2.9778 2.5575 40.0188 41.6062 3.5395 15.2481 8.0595 4.3585 0.3815 4.9498 2.9450 3.8177 2.9439 2.4422 7.2938 4.6446 2.1224 12.6868 7.8892 8.4674 11.1812 51.1557 3.9521 15.2113 10.1859 92.2132 12.7767 22.2223 26.1990 56.3741 2.9329 61.6591 1605.0875 51.2211 108.2238 45.9088 19.9416 31.6689 55.3541 30.2230 101.5426 37.4385 80.7932 53.8724 18.5314 17.5122 49.2758 27.6768 32.3837 23.5821 18.8241 21.8308 45.1640 37.8822 34.3337 24.9940 23.7366 5.6181
temp: 298.150 k
press: 1.00000 atm
elementType: 8 8 8 7 7 6 6 6 6 6 6 6 6 6 6 6 6 6 6 6 6 6 1 1 1 1 1 1 1 1 1 1 1 1 1 1 1 1 1 1 1 1 1 1 1 1 1 1
symmnumber: 1
zpe: 1074461.1 jmol-1
zpe.correction: 0.409241 hartree
zpe.thermalcorrener: 0.428642 hartree
zpe.thermalcorrenthalpy: 0.429586 hartree
zpe.thermalcorrgfe: 0.361281 hartree
zpe.sumelectzpe: -996.834198 hartree
zpe.sumelectthermal: -996.814797 hartree
zpe.sumelectthermalent: -996.813853 hartree
zpe.sumelectthermalfe: -996.882158 hartree
dipole: 3.4728 2.2172 -0.4658
dipole: 4.1464
quadrupole: -136.1284 -135.7475 -129.7154
quadrupole: 0.8914 -0.2189 5.2148
quadrupole: -2.2646 -1.8838 4.1483 0.8914 -0.2189 5.2148
hfenergy: -997.2434385 hartree
pointgroup: C01[X(C17H26N2O3)]
dipole: 1.3797936 -0.8672225 0.0730347 debye
polarizability: 253.9666631|4.6354371|199.3518795|4.2146079|21.7088464|168.7899311 unknown
InChI: InChI=1S/C17H26N2O3/c1-14-10-15(12-18-2-6-21-7-3-18)17(20)16(11-14)13-19-4-8-22-9-5-19/h10-11,20H,2-9,12-13H2,1H3
charge 0 multiplicity 1
48 atoms
O  -5.40706 1.830711 -0.720964
O  4.988028 2.351826 -0.531834
O  1.012727 0.602195 1.332531
N  -3.139508 0.471013 0.486039
N  3.321737 0.108925 0.262992
C  -1.837256 0.346148 1.188497
C  2.884554 -1.330727 0.315075
C  -3.013569 1.169872 -0.818845
C  -4.17532 1.128767 1.320941
C  3.267197 0.66722 -1.125109
C  4.675366 0.316865 0.856927
C  -0.90679 -0.670602 0.539555
C  1.386968 -1.471591 0.083916
C  0.50066 -0.509955 0.656286
C  -4.369657 1.179458 -1.540577
C  -5.519213 1.137256 0.573508
C  3.642669 2.156192 -1.099819
C  5.031412 1.813022 0.836102
C  -1.403374 -1.794815 -0.155635
C  0.850076 -2.571991 -0.621091
C  -0.547432 -2.757889 -0.749447
C  -1.117936 -3.955948 -1.491289
H  -2.052214 0.025801 2.228521
H  -1.301878 1.321259 1.271239
H  3.455726 -1.948866 -0.412179
H  3.142915 -1.691021 1.332152
H  -2.266088 0.640318 -1.437643
H  -2.662117 2.223946 -0.679827
H  -3.895058 2.18279 1.575025
H  -4.284903 0.567224 2.268671
H  2.242934 0.535049 -1.517205
H  3.971768 0.114611 -1.786655
H  5.442493 -0.256671 0.288336
H  4.665324 -0.052382 1.899456
H  -4.323376 1.764484 -2.474116
H  -4.675259 0.134841 -1.767939
H  -5.856781 0.09079 0.408472
H  -6.287241 1.691227 1.138679
H  2.894987 2.724561 -0.50532
H  3.689322 2.568658 -2.12038
H  6.063056 1.976177 1.187537
H  4.32616 2.376066 1.48563
H  -2.49298 -1.892864 -0.237694
H  1.536014 -3.303876 -1.069193
H  -0.322583 -4.543461 -1.98288
H  -1.658646 -4.636437 -0.8055
H  -1.838559 -3.646085 -2.271347
H  2.034003 0.639706 1.069001
