program: Gaussian 09
title: 000231900
version: EM64L-G09RevD.01
frameworkgroup: C1[X(C21H35N)]
method: RPBEPBE
basis: SDD
operation: Freq
keyword: #pfreq=noraman
keyword: PBEPBE/SDD
title: #p freq=noraman PBEPBE/SDD
converged: YES YES NO NO
title: Mulliken charges:
elementType: N C C C C C C C C C C C C C C C C C C C C C H H H H H H H H H H H H H H H H H H H H H H H H H H H H H H H H H H H
charge: -0.089381 -0.358289 -0.446785 -0.370122 -0.493409 -0.352955 -0.374248 -0.540653 -0.387475 0.267110 0.270085 -0.384811 -0.384764 -0.382012 -0.372704 -0.381137 -0.393125 -0.353386 -0.250524 -0.245720 -0.356649 -0.696913 0.204503 0.182349 0.208621 0.202118 0.186491 0.213428 0.235974 0.193532 0.225488 0.181669 0.184804 0.188846 0.207176 0.233488 0.196770 0.191536 0.193470 0.191428 0.193944 0.192208 0.192167 0.190847 0.188766 0.189754 0.229288 0.231140 0.186994 0.187792 0.225166 0.224963 0.194537 0.194871 0.214667 0.209439 0.209632
chargesum: 0.00000
title: Mulliken charges with hydrogens summed into heavy atoms:
elementType: N C C C C C C C C C C C C C C C C C C C C C
charge: -0.089381 0.028562 -0.036046 0.029797 -0.063904 0.054203 -0.000597 -0.099989 0.000830 0.267110 0.270085 0.000088 0.001387 0.001002 0.005816 -0.151849 -0.161985 0.021400 -0.025358 -0.020757 0.032758 -0.063174
polarizability: 2.54920582e+02 -1.88969659e+01 2.28788494e+02 -1.33565822e+01 -6.45165930e+00 2.08478883e+02
1716.lowfreq: -7.1178 -0.0016 0.0010 0.0011 3.7742 6.0158 9.2884 23.2314 24.0288
frequency: 9.2608 23.2062 23.9862 32.5911 40.3019 52.4627 61.9625 72.6732 87.0314 100.4224 108.0208 125.7072 136.4970 144.2507 149.4699 168.8891 169.0745 201.2086 224.6089 227.1158 256.2023 272.6348 282.5055 328.5693 361.6998 370.0936 399.7439 408.7198 430.0173 466.8687 473.3595 482.0068 503.5845 545.3470 580.7784 623.0106 712.1183 719.2352 721.0080 725.3457 733.1705 735.4049 745.4837 760.5177 781.0286 810.9404 837.6186 854.0378 867.4692 882.7746 887.0949 918.4522 930.6070 939.4664 952.3837 979.9380 983.0982 984.7074 993.2759 995.4045 1019.6649 1025.4558 1032.3064 1036.3121 1049.7323 1058.8117 1066.5796 1078.1770 1080.3408 1081.2008 1090.2235 1104.4499 1106.6156 1122.9625 1139.1312 1170.7489 1174.0372 1183.8842 1191.4097 1199.4509 1202.9206 1205.2221 1223.8366 1228.9033 1233.5415 1238.6758 1249.9482 1259.5057 1266.3127 1269.4657 1276.3007 1280.3224 1282.9589 1285.9025 1291.4945 1293.7818 1295.8039 1302.4395 1320.7685 1327.5445 1340.1588 1345.1334 1351.6468 1353.8351 1355.1649 1359.0695 1362.1356 1385.2393 1388.1493 1393.8266 1441.5908 1445.5294 1459.2057 1459.7124 1460.2702 1462.4299 1462.7560 1464.6009 1467.3729 1468.2159 1473.2436 1475.9058 1478.8248 1481.5861 1483.7923 1487.2450 1489.2795 1492.3641 1595.8800 1616.4567 2788.7208 2821.0091 2844.3105 2945.3255 2947.7563 2948.4695 2950.1424 2951.8263 2956.3094 2960.6520 2963.5562 2968.2226 2970.9606 2972.2542 2978.2440 2981.2348 2983.6991 2988.1998 2995.4788 3000.2969 3006.5007 3010.6956 3016.8519 3021.5452 3030.7137 3031.3860 3035.0999 3040.2763 3047.4316 3067.6157 3069.4259 3109.2255 3114.5858 3135.3297 3157.8768
redmass: 4.6342 3.6587 4.0178 1.7639 2.8700 2.8811 1.7402 3.6567 2.7079 2.0854 2.4839 2.0144 2.8719 2.0445 2.0254 3.4074 3.4451 2.8087 1.2083 2.3313 2.4205 2.5473 3.2615 2.4921 3.1363 3.3506 3.0426 3.4093 2.5915 3.2078 2.9963 3.0883 3.7161 2.7938 3.8401 3.9529 3.2453 1.0625 1.0702 1.1048 2.9389 1.3699 1.2615 1.2784 1.4866 1.4101 2.8589 1.4417 1.3318 1.5800 1.8980 1.4465 2.4598 1.3897 1.8737 1.3658 1.3273 4.3662 1.7855 3.5297 1.3512 3.2161 1.8960 1.9852 2.4786 2.6214 2.2359 2.3258 2.1899 2.1915 2.4579 2.3759 1.9253 2.7780 1.9981 1.4412 1.3680 1.7642 1.1583 1.5772 1.6891 1.5406 1.4448 1.3807 1.6980 1.5105 1.3197 1.2980 1.4456 1.2730 1.0400 1.1680 1.1137 1.1663 1.1335 1.1511 1.1733 1.3616 1.3575 1.4032 1.4657 1.5067 1.6538 1.6042 1.6636 1.5737 1.6874 2.3519 1.2176 1.9641 2.0855 1.1930 1.0762 1.0744 1.0862 1.0836 1.0699 1.0853 1.0810 1.0841 1.0832 1.0466 1.0856 1.1045 1.0966 1.1065 1.0983 2.2700 6.7588 6.4896 1.0713 1.0705 1.0707 1.0588 1.0586 1.0590 1.0592 1.0596 1.0601 1.0622 1.0603 1.0585 1.0368 1.0611 1.0603 1.0956 1.0964 1.0982 1.1003 1.0917 1.1020 1.0857 1.0977 1.1002 1.0982 1.0976 1.0975 1.1043 1.1024 1.1007 1.0993 1.0867 1.0888 1.0927 1.1004
irintensity: 0.0156 0.0814 0.0216 0.0142 0.0129 0.0798 0.0040 0.1257 0.0105 0.0316 0.0147 0.0451 0.5185 0.0186 0.0059 0.0164 0.0554 0.1694 0.1430 1.1094 10.1588 0.5873 0.3100 2.3469 1.0328 0.8141 1.5611 0.5239 6.0122 0.5183 0.5992 0.1865 0.5002 1.4001 0.3236 3.2911 0.1429 15.5114 3.8494 6.3579 17.4024 10.9742 46.6712 12.9473 2.2263 0.5502 5.7033 1.5221 0.2305 1.5485 5.4585 1.4056 15.4594 2.2767 2.1081 1.4810 0.0500 0.0601 2.3110 1.3361 1.6210 0.3538 3.7647 7.2314 3.7151 2.2332 0.8090 1.0958 0.3723 0.5882 3.4652 11.7856 34.0353 15.5270 31.2496 2.4060 3.2840 1.0002 3.9384 19.6600 4.9073 2.6564 0.6192 7.6483 1.6819 11.0920 1.7315 2.3832 0.7621 1.0426 1.0830 1.4748 0.9718 2.6435 1.0502 0.7861 1.6169 8.8018 1.4371 8.6932 1.1021 1.8957 0.5873 1.8062 0.9464 11.8033 10.0501 2.2466 11.2148 1.8493 2.4520 15.5488 2.5037 0.1293 7.1354 1.4689 0.0244 0.6317 6.4314 1.0644 0.9504 11.0139 2.0759 14.5076 1.2970 4.1029 37.5278 18.9694 3.8460 0.8502 64.0026 72.7092 197.2954 4.8362 0.6206 0.3808 0.3749 3.0591 0.5648 8.5173 87.7106 168.5375 36.1884 89.2763 27.8755 2.4626 2.3988 2.0755 1.2501 7.3364 3.7642 21.5241 23.6168 6.9200 13.1674 33.2995 45.8172 98.4581 250.3866 99.5253 56.7142 14.8747 3.3438 31.0238 35.5398
temp: 298.150 k
press: 1.00000 atm
elementType: 7 6 6 6 6 6 6 6 6 6 6 6 6 6 6 6 6 6 6 6 6 6 1 1 1 1 1 1 1 1 1 1 1 1 1 1 1 1 1 1 1 1 1 1 1 1 1 1 1 1 1 1 1 1 1 1 1
symmnumber: 1
zpe: 1344922.3 jmol-1
zpe.correction: 0.512254 hartree
zpe.thermalcorrener: 0.537059 hartree
zpe.thermalcorrenthalpy: 0.538003 hartree
zpe.thermalcorrgfe: 0.452843 hartree
zpe.sumelectzpe: -874.239488 hartree
zpe.sumelectthermal: -874.214683 hartree
zpe.sumelectthermalent: -874.213739 hartree
zpe.sumelectthermalfe: -874.298900 hartree
dipole: -0.3846 -0.9761 -0.0726
dipole: 1.0517
quadrupole: -140.3986 -133.1236 -133.9722
quadrupole: 0.9700 -2.4443 -1.9031
quadrupole: -4.5672 2.7079 1.8593 0.9700 -2.4443 -1.9031
hfenergy: -874.7517423 hartree
pointgroup: C01 [X(C21H35N1)]
dipole: 0.1461045 0.3853941 -0.0363362 debye
polarizability: 255.5602771|-18.272035|228.5316558|13.3383859|6.366678|208.0960255 unknown
InChI: InChI=1S/C21H35N/c1-2-3-4-5-6-7-8-9-10-13-17-22-18-16-20-14-11-12-15-21(20)19-22/h11-12,14-15H,2-10,13,16-19H2,1H3
charge 0 multiplicity 1
57 atoms
N  3.412155 1.43986 0.196731
C  2.809547 2.725339 -0.234111
C  1.4338 2.570522 -0.920337
C  4.565123 1.627847 1.110623
C  3.77388 0.577997 -0.950539
C  0.370281 1.89805 -0.025518
C  -0.986312 1.705447 -0.738929
C  4.926081 0.287619 1.775978
C  -2.072441 1.087626 0.17058
C  4.535897 -0.67958 -0.547784
C  5.107535 -0.816539 0.744504
C  -3.421054 0.86318 -0.550018
C  -4.5191 0.283459 0.370078
C  -5.864261 0.047577 -0.353371
C  -6.969069 -0.509641 0.572783
C  4.700288 -1.720101 -1.49584
C  5.83417 -1.993431 1.057674
C  -8.31363 -0.749192 -0.15059
C  5.421694 -2.889384 -1.176306
C  5.99386 -3.027095 0.110836
C  -9.421406 -1.29468 0.779788
C  -10.761505 -1.529577 0.049518
H  2.682634 3.349184 0.672463
H  3.499613 3.283652 -0.922206
H  1.537099 2.002468 -1.866948
H  1.087934 3.583459 -1.212476
H  5.459652 2.035887 0.570785
H  4.279484 2.366967 1.881293
H  2.8496 0.283773 -1.481331
H  4.397388 1.147946 -1.694526
H  0.759516 0.92244 0.3249
H  0.222647 2.514967 0.886069
H  -1.346092 2.683807 -1.122845
H  -0.843377 1.05743 -1.629558
H  5.845605 0.399492 2.382761
H  4.10781 0.010636 2.469504
H  -1.705865 0.12048 0.573632
H  -2.231722 1.748421 1.048486
H  -3.26655 0.18046 -1.411831
H  -3.772984 1.826111 -0.976616
H  -4.164478 -0.674208 0.805707
H  -4.679574 0.972481 1.225792
H  -5.707178 -0.653675 -1.19966
H  -6.210809 1.002257 -0.802155
H  -7.12781 0.194361 1.416589
H  -6.621827 -1.462326 1.025152
H  4.256261 -1.611678 -2.494016
H  6.278911 -2.09511 2.055907
H  -8.658397 0.201379 -0.609414
H  -8.158439 -1.459788 -0.989481
H  5.537248 -3.685319 -1.920531
H  6.55922 -3.92939 0.369975
H  -9.574423 -0.58385 1.617529
H  -9.076712 -2.244401 1.237844
H  -11.536243 -1.918688 0.73581
H  -11.142094 -0.588843 -0.391657
H  -10.641179 -2.259585 -0.773301
