program: Gaussian 09
title: 000231884
version: EM64L-G09RevD.01
frameworkgroup: C1[X(C13H6N4O9)]
method: RPBEPBE
basis: SDD
operation: Freq
keyword: #p
keyword: freq=noraman
keyword: PBEPBE/SDD
title: #p freq=noraman PBEPBE/SDD
converged: YES YES NO NO
title: Mulliken charges:
elementType: O O O O O O O O O N N N N C C C C C C C C C C C C C H H H H H H
charge: -0.111555 -0.154509 -0.154503 -0.189831 -0.189840 -0.181878 -0.181881 -0.179019 -0.179016 0.023796 0.023789 0.026650 0.026648 0.274359 0.274387 -0.018142 0.273838 0.273855 -0.284884 -0.284756 -0.516845 -0.516856 0.436456 0.436474 -0.389796 -0.389874 0.286769 0.286683 0.336026 0.336017 0.303719 0.303719
chargesum: 0.00000
title: Mulliken charges with hydrogens summed into heavy atoms:
elementType: O O O O O O O O O N N N N C C C C C C C C C C C C C
charge: -0.111555 -0.154509 -0.154503 -0.189831 -0.189840 -0.181878 -0.181881 -0.179019 -0.179016 0.023796 0.023789 0.026650 0.026648 0.274359 0.274387 -0.018142 0.273838 0.273855 0.001885 0.001927 -0.180819 -0.180839 0.436456 0.436474 -0.086077 -0.086155
polarizability: 3.20594638e+02 -3.73779602e+00 2.05446959e+02 -1.85001464e-02 -1.20466726e-02 1.44734948e+02
1716.lowfreq: -0.0008 -0.0006 -0.0001 1.3680 2.4273 6.0005 23.5174 29.3676 34.7676
frequency: 23.5082 29.3285 34.7640 51.2025 55.6922 64.3461 91.9480 93.1528 110.2020 119.1752 142.5924 147.7941 151.7133 168.9256 178.6125 218.5227 230.6879 271.3175 301.1060 304.4032 334.3179 345.0686 372.2864 403.5400 420.5147 432.6779 484.0898 484.9787 499.1399 515.5696 555.0208 578.6944 589.1828 641.2757 648.5327 648.9904 669.3160 670.4651 705.8243 706.0906 717.8470 724.5774 757.9853 759.6515 766.1678 781.4184 838.5307 868.8445 872.4133 877.9027 922.4045 955.0366 955.0769 1004.2177 1004.5474 1045.8217 1058.5164 1101.9605 1110.5924 1143.5606 1147.5325 1148.7486 1204.9406 1206.3704 1216.8604 1220.2085 1244.0510 1256.8304 1266.3367 1358.4886 1365.2319 1380.2588 1380.9775 1397.7998 1401.3245 1410.9677 1413.8519 1461.6036 1464.3976 1582.5792 1586.4347 1590.7607 1604.1113 1604.8703 3175.7701 3175.8785 3187.0095 3187.0445 3191.5314 3191.6004
redmass: 13.6108 11.8613 9.5920 14.0925 15.4434 10.4363 10.9679 8.7129 12.6444 13.1613 11.8331 6.2091 6.2558 10.8890 15.0520 9.9543 9.8220 8.4017 8.8806 11.4459 12.7757 11.8424 8.1804 3.8990 3.9209 8.6065 7.4468 7.3088 9.0248 5.9575 6.7336 4.6741 5.9891 7.8862 8.8331 7.9017 8.2250 7.9994 5.4016 8.6775 7.3470 9.6773 11.6621 11.0548 5.1979 4.6950 4.8991 8.1091 1.7300 1.4704 5.4445 1.4827 1.4886 1.3778 1.3888 2.8113 1.8894 2.9744 5.6009 1.6306 1.4021 3.1813 10.0663 9.8613 9.7655 12.3914 3.1726 1.4096 1.6872 4.4772 5.2146 12.4054 11.7611 12.0531 11.2402 6.2316 6.2410 2.6883 2.7648 9.0110 8.7691 11.2387 7.4169 7.8900 1.0898 1.0897 1.0928 1.0928 1.0970 1.0970
irintensity: 0.2375 0.6525 1.6136 0.5315 0.2923 3.2631 0.2595 4.2374 0.0401 1.1204 13.0748 3.0748 5.1442 0.9816 3.2966 4.3465 0.7971 2.7909 0.2959 0.5411 6.3370 0.0014 0.0698 3.8696 0.8083 20.4342 5.1116 3.2451 0.1246 3.6344 19.3240 0.8238 8.2273 2.3850 7.5794 10.7278 5.8487 4.5202 41.0790 30.7373 4.7802 8.2555 52.4408 0.0867 12.0648 0.9683 115.9037 5.2543 2.8782 38.4017 56.0182 47.0653 5.8701 0.7739 2.3418 4.3697 35.6845 6.3366 24.8620 0.3222 11.8360 7.5403 656.1663 137.9237 159.1116 0.2982 44.9842 5.5013 156.9574 18.4691 82.3710 250.2064 13.3549 9.3560 101.8360 30.0433 143.4477 0.6152 0.5801 19.1404 12.7029 50.0739 11.2759 20.7316 9.1026 3.9760 35.9907 12.4003 2.3826 0.6908
temp: 298.150 k
press: 1.00000 atm
elementType: 8 8 8 8 8 8 8 8 8 7 7 7 7 6 6 6 6 6 6 6 6 6 6 6 6 6 1 1 1 1 1 1
symmnumber: 1
zpe: 501151.7 jmol-1
zpe.correction: 0.190879 hartree
zpe.thermalcorrener: 0.212866 hartree
zpe.thermalcorrenthalpy: 0.213811 hartree
zpe.thermalcorrgfe: 0.136893 hartree
zpe.sumelectzpe: -1392.818793 hartree
zpe.sumelectthermal: -1392.796805 hartree
zpe.sumelectthermalent: -1392.795861 hartree
zpe.sumelectthermalfe: -1392.872779 hartree
dipole: 0.0018 -0.0011 -2.8604
dipole: 2.8604
quadrupole: -193.3781 -156.7024 -161.2074
quadrupole: 2.0288 0.0062 -0.0086
quadrupole: -22.9488 13.7269 9.2219 2.0288 0.0062 -0.0086
hfenergy: -1393.0096714 hartree
pointgroup: C01 [X(C13H6N4O9)]
dipole: 0.0005517 1.1253441 0.0077176 debye
polarizability: 320.7140543|-0.2199189|144.7379386|0.4175964|-0.4065049|205.324552 unknown
InChI: InChI=1S/C13H6N4O9/c18-13(9-3-1-7(14(19)20)5-11(9)16(23)24)10-4-2-8(15(21)22)6-12(10)17(25)26/h1-6H
charge 0 multiplicity 1
32 atoms
O  -0.002219 -2.413649 -0.018351
O  -3.167564 -1.671677 2.686174
O  3.165394 -1.640974 -2.709485
O  -0.942629 -1.182213 2.549315
O  0.941699 -1.147353 -2.56732
O  -5.283254 2.092362 -1.987822
O  5.28728 2.053094 2.017466
O  -6.054488 1.286542 0.005227
O  6.058019 1.272594 0.014168
N  -2.150645 -1.172414 2.085869
N  2.149402 -1.147397 -2.102942
N  -5.139294 1.437453 -0.888069
N  5.142513 1.413643 0.908755
C  -1.300114 -0.379945 -0.147965
C  1.299685 -0.384626 0.141492
C  -0.000978 -1.160081 -0.008951
C  -2.367632 -0.491791 0.780956
C  2.367338 -0.485695 -0.78849
C  -1.529159 0.365043 -1.330837
C  1.529728 0.343425 1.334676
C  -3.631956 0.077508 0.55757
C  3.632831 0.077541 -0.556541
C  -3.8118 0.807529 -0.630983
C  3.813689 0.790507 0.64218
C  -2.778926 0.969046 -1.576893
C  2.780682 0.941194 1.589725
H  -0.732027 0.432119 -2.075145
H  0.73239 0.401929 2.079474
H  -4.441892 -0.029308 1.283988
H  4.442929 -0.021012 -1.283953
H  -2.967243 1.544536 -2.487035
H  2.969839 1.503573 2.507848
