program: Gaussian 09
title: 000231864
version: EM64L-G09RevD.01
frameworkgroup: C1[X(C21H18N2O2)]
method: RPBEPBE
basis: SDD
operation: Freq
keyword: #p
keyword: freq=noraman
keyword: PBEPBE/SDD
title: #p freq=noraman PBEPBE/SDD
converged: YES YES NO NO
title: Mulliken charges:
elementType: O O N N C C C C C C C C C C C C C C C C C C C C C H H H H H H H H H H H H H H H H H H
charge: -0.255393 -0.244225 -0.504418 -0.520865 0.295482 0.282156 0.491667 -0.465073 -0.305587 -0.452575 -0.817147 0.131178 0.124877 0.249704 0.255374 -0.346030 -0.356039 -0.348088 -0.356673 -0.224165 -0.239529 -0.224035 -0.238528 -0.226283 -0.226191 0.296429 0.277019 0.235188 0.316131 0.310066 0.222521 0.234214 0.235131 0.275398 0.220253 0.275928 0.217752 0.234316 0.232874 0.234752 0.232740 0.234711 0.234986
chargesum: 0.00000
title: Mulliken charges with hydrogens summed into heavy atoms:
elementType: O O N N C C C C C C C C C C C C C C C C C C C C C
charge: -0.255393 -0.244225 -0.188287 -0.210799 0.295482 0.282156 0.491667 -0.168643 -0.028568 -0.217387 -0.125281 0.131178 0.124877 0.249704 0.255374 -0.070633 -0.135786 -0.072161 -0.138921 0.010151 -0.006655 0.010717 -0.005788 0.008428 0.008794
polarizability: 3.04267846e+02 2.73789310e+01 3.36332625e+02 3.45701675e+01 -1.16999521e+01 1.60174532e+02
1716.lowfreq: -40.2034 -14.9291 -11.2491 -6.1772 -3.5595 -0.0005 -0.0004 -0.0001 15.6058
frequency: -40.1739 -14.4327 15.2144 24.3813 39.8980 41.8388 49.7460 80.9284 95.9992 128.7105 144.4120 154.0094 173.6841 209.2845 225.8345 268.9692 285.6182 305.7546 322.9015 354.1038 400.6784 401.8430 408.1545 411.1976 444.1641 458.6509 477.6977 481.1417 525.3433 555.8673 580.6238 594.3349 613.3199 614.1040 657.9331 673.4804 683.4931 686.6366 701.9231 703.4310 712.6190 730.2513 739.4642 786.2115 791.9483 805.0345 816.0223 853.8046 854.4702 868.3227 876.1642 902.2662 932.3120 935.2736 945.2376 955.6599 984.5827 984.9167 989.2891 989.4774 1006.4482 1006.7650 1010.3799 1022.8532 1024.7763 1047.9995 1066.2728 1077.7912 1087.2323 1094.3963 1138.1196 1174.2438 1174.3527 1177.4759 1192.6063 1193.6515 1224.4612 1239.3275 1250.3798 1293.8651 1301.4819 1318.8055 1321.2546 1369.8071 1383.9507 1384.3242 1396.2797 1424.5976 1431.4437 1432.1179 1453.9978 1460.6534 1469.4192 1477.5269 1483.5787 1485.3515 1522.3216 1576.0056 1576.8934 1596.1150 1608.8287 1609.1612 1610.7377 1611.0941 1625.4015 2977.7502 3057.4213 3086.3299 3114.5777 3114.9423 3133.1407 3133.1936 3137.2895 3146.1204 3146.1676 3158.9634 3159.3178 3170.5159 3170.6481 3181.1886 3188.8458 3504.9887 3508.2494
redmass: 1.0201 4.7975 4.7178 5.1144 5.3855 4.3779 5.4206 6.1197 5.2449 4.4807 4.7144 5.0916 4.6022 5.7510 5.4449 5.6798 5.0055 4.7430 5.6413 4.6450 2.9905 2.8663 4.3547 4.8759 3.6491 3.5294 3.8406 4.8275 5.0304 1.3624 3.5865 5.4368 6.3402 6.3214 5.9038 6.0404 4.7963 5.2718 1.5123 1.5277 1.8200 3.6140 2.2234 2.7410 2.3882 4.2859 1.3955 1.2847 1.2959 5.3159 4.0376 1.4740 1.5703 1.4498 2.4610 1.3694 1.4932 1.4743 4.7133 4.5339 1.3444 1.3472 1.6752 2.5736 2.4184 1.5578 3.0114 1.9774 1.6632 2.1507 1.8062 1.0625 1.0601 1.7979 1.1222 1.1325 1.5814 2.9000 3.2194 1.7691 2.1902 1.3351 1.4619 5.7905 8.6465 8.5298 1.2373 3.8355 2.2582 2.2813 1.8874 2.0804 1.0591 1.3538 2.2496 1.9130 2.6274 6.2453 6.1204 5.3418 5.9534 5.8124 6.3638 6.1818 6.7607 1.0376 1.0967 1.0993 1.0880 1.0882 1.0867 1.0867 1.0905 1.0918 1.0916 1.0956 1.0956 1.1009 1.1008 1.0925 1.0949 1.0757 1.0755
irintensity: 0.3583 5.1038 0.4238 0.0230 4.3453 1.1197 1.5854 1.6125 6.0927 1.6927 2.6006 0.6649 2.2591 4.0035 1.2844 8.4323 4.4165 3.7737 1.2744 0.2311 0.9329 0.4428 2.2816 3.3566 4.0988 9.7404 5.9294 2.3221 3.5320 142.2527 13.8761 5.0603 1.5015 2.2509 16.9127 17.7017 2.5733 14.3102 69.1391 97.5105 37.2208 5.7817 14.1353 9.2016 21.5353 8.1591 37.9239 1.1077 0.9348 11.6849 10.7667 9.1535 5.8904 2.0934 7.6211 2.8744 1.4787 2.4132 0.5175 0.7181 1.8439 2.1575 3.7125 9.9416 15.8854 14.4094 20.5343 15.2957 26.4521 3.7268 11.3207 1.8773 1.4148 1.2573 11.2659 9.1977 5.0527 132.2859 116.6222 81.2296 22.6451 2.3196 6.8612 33.1056 1.1072 0.1285 18.6137 311.9179 6.5413 5.1819 173.9897 372.3934 12.9079 20.3070 71.3263 34.7245 266.7354 38.2799 63.7703 30.8769 29.9697 27.2789 16.9916 76.5589 18.8261 40.3583 18.9260 19.4711 15.9234 14.4213 1.0111 0.9673 18.7906 20.3714 18.3109 13.8961 13.7110 17.9111 26.7375 1.0506 2.1843 26.1644 12.7760
temp: 298.150 k
press: 1.00000 atm
elementType: 8 8 7 7 6 6 6 6 6 6 6 6 6 6 6 6 6 6 6 6 6 6 6 6 6 1 1 1 1 1 1 1 1 1 1 1 1 1 1 1 1 1 1
symmnumber: 1
zpe: 885074.1 jmol-1
zpe.correction: 0.337107 hartree
zpe.thermalcorrener: 0.357354 hartree
zpe.thermalcorrenthalpy: 0.358298 hartree
zpe.thermalcorrgfe: 0.285417 hartree
zpe.sumelectzpe: -1069.293151 hartree
zpe.sumelectthermal: -1069.272904 hartree
zpe.sumelectthermalent: -1069.271960 hartree
zpe.sumelectthermalfe: -1069.344840 hartree
dipole: -1.6482 -4.2441 0.8053
dipole: 4.6236
quadrupole: -146.5497 -125.6739 -145.2643
quadrupole: 10.0273 -5.3252 2.5263
quadrupole: -7.3871 13.4888 -6.1017 10.0273 -5.3252 2.5263
hfenergy: -1069.6302578 hartree
pointgroup: C01 [X(C21H18N2O2)]
dipole: -0.3074232 1.7676386 -0.2998555 debye
polarizability: 295.2090699|-18.7287954|345.7053907|-35.9418905|-2.8670626|159.8605416 unknown
InChI: InChI=1S/C21H18N2O2/c1-15-12-13-18(22-20(24)16-8-4-2-5-9-16)19(14-15)23-21(25)17-10-6-3-7-11-17/h2-14,22-23H,1H3
charge 0 multiplicity 1
43 atoms
O  3.570537 -0.690081 -0.812579
O  -3.117595 -1.403982 1.204505
N  1.40809 -0.429327 0.062699
N  -1.331885 -0.758866 -0.170377
C  0.907688 -1.76145 -0.032151
C  -0.512366 -1.928584 -0.059938
C  1.202857 -4.203019 -0.045037
C  1.749937 -2.897617 -0.056246
C  -1.058828 -3.229796 -0.018921
C  -0.20678 -4.352624 -0.006569
C  2.121063 -5.412726 -0.049202
C  2.690571 0.032546 -0.252371
C  -2.603776 -0.579377 0.390662
C  2.951319 1.477759 0.093467
C  -3.310692 0.690688 -0.013857
C  3.993098 2.133926 -0.611707
C  2.239268 2.189713 1.096002
C  -4.320616 1.174234 0.857634
C  -3.040796 1.39434 -1.218313
C  4.299692 3.483078 -0.342354
C  2.550634 3.539972 1.36846
C  -5.028053 2.353307 0.547785
C  -3.753528 2.573068 -1.530186
C  3.5757 4.192563 0.645519
C  -4.742994 3.059761 -0.645132
H  2.831738 -2.749965 -0.085248
H  -2.143602 -3.352061 0.003266
H  -0.64412 -5.357009 0.019145
H  0.758571 0.25242 0.463696
H  -0.990493 -0.021435 -0.79262
H  1.555349 -6.348631 -0.196201
H  2.87734 -5.340236 -0.85191
H  2.671306 -5.500457 0.907112
H  4.550597 1.559925 -1.358985
H  1.473341 1.695911 1.707452
H  -4.535256 0.601783 1.765942
H  -2.314212 1.012996 -1.947172
H  5.102134 3.980941 -0.897385
H  2.003436 4.076889 2.150841
H  -5.801592 2.720627 1.230781
H  -3.546364 3.102715 -2.466333
H  3.815595 5.240092 0.858442
H  -5.294711 3.974286 -0.889019
