program: Gaussian 09
title: 000231865
version: EM64L-G09RevD.01
frameworkgroup: C1[X(C22H34N2O2)]
method: RPBEPBE
basis: SDD
operation: Freq
keyword: #p
keyword: freq=noraman
keyword: PBEPBE/SDD
title: #p freq=noraman PBEPBE/SDD
converged: NO YES NO NO
title: Mulliken charges:
elementType: O O N N C C C C C C C C C C C C C C C C C C C C C C H H H H H H H H H H H H H H H H H H H H H H H H H H H H H H H H H H
charge: -0.288153 -0.286424 -0.157447 -0.684785 -0.002685 -0.027329 -0.448067 -0.457549 -0.415544 -0.454620 -0.412619 -0.376366 -0.401266 -0.396955 -0.408009 -0.411233 -0.385812 -0.398018 -0.304386 0.194915 0.222625 -0.337736 -0.324410 -0.404573 -0.400095 0.500283 0.180724 0.170109 0.199148 0.200904 0.204900 0.216286 0.193314 0.213680 0.191756 0.254942 0.200845 0.202157 0.191609 0.195655 0.184574 0.192039 0.195074 0.180176 0.182086 0.252771 0.198063 0.196009 0.191227 0.195633 0.219656 0.202575 0.260649 0.208791 0.264174 0.266262 0.220568 0.219096 0.310246 0.310558
chargesum: 0.00000
title: Mulliken charges with hydrogens summed into heavy atoms:
elementType: O O N N C C C C C C C C C C C C C C C C C C C C C C
charge: -0.288153 -0.286424 -0.157447 -0.063980 0.178039 0.142780 -0.048015 -0.036363 -0.008550 -0.007922 -0.009617 0.010899 -0.024652 -0.021704 0.026847 -0.017161 0.001048 0.024213 0.165054 0.194915 0.222625 -0.073561 -0.058148 -0.184005 -0.180999 0.500283
polarizability: 3.67562103e+02 8.29626057e+00 2.53460481e+02 -1.34520189e+01 -7.99583188e+00 1.83294354e+02
1716.lowfreq: -6.1290 -1.0735 -0.0012 -0.0010 0.0009 5.7179 16.0582 22.5354 24.7549
frequency: 9.6338 22.2463 24.2556 43.5286 52.5163 53.9264 60.4285 68.8408 79.3479 100.8987 107.3165 113.8903 143.4900 166.9035 194.8186 207.8060 224.6549 244.7111 260.1199 268.6858 273.7351 291.1534 305.9474 331.0751 364.3091 367.5402 392.3656 406.2083 408.7688 415.6754 416.7060 427.4208 432.0797 453.4195 462.5793 486.7453 488.7327 508.7866 521.3903 549.4248 599.1047 605.0436 633.4015 675.5950 734.4824 738.4639 753.6716 758.7894 779.7629 784.2691 797.3326 817.0915 824.4156 826.1182 841.8405 843.1632 848.0684 872.2086 891.9209 893.9073 898.3879 903.2010 909.5131 915.5590 916.3864 948.3280 972.0530 974.2765 983.3678 996.8448 1000.4768 1017.6578 1036.2374 1042.1423 1053.7400 1055.6805 1065.4160 1066.3797 1077.7788 1081.0938 1090.9538 1101.3154 1110.0534 1112.0179 1121.9950 1129.9483 1154.7381 1160.8856 1179.8217 1184.1338 1188.5151 1203.4392 1217.4528 1239.7534 1246.9189 1251.7911 1257.0363 1259.7151 1266.0877 1271.3617 1284.2553 1292.7124 1300.4854 1307.7356 1311.2997 1323.3781 1324.7097 1324.9317 1330.3319 1331.4019 1332.3013 1338.1315 1338.9145 1340.1359 1344.9799 1346.0075 1353.9921 1368.6546 1377.8497 1391.5667 1392.0177 1446.9628 1448.5029 1456.3201 1459.6850 1462.5925 1463.4599 1466.0705 1466.1943 1469.4519 1470.9408 1471.7819 1479.4371 1483.6911 1489.7800 1516.7396 1569.2136 1604.7426 1631.5015 1646.2728 2871.3657 2954.7829 2955.8655 2960.8636 2966.0562 2967.2427 2967.5933 2973.4652 2974.2269 2976.7213 2981.7136 2984.9147 2985.5841 2987.6224 3015.8704 3017.6307 3022.9904 3028.3581 3029.0839 3031.1439 3035.2680 3037.7627 3040.8146 3044.9792 3050.4937 3055.4218 3064.4881 3106.5367 3123.1206 3125.9386 3158.6323 3174.4119 3561.5393 3701.4596
redmass: 4.5661 4.2184 4.7050 3.4057 3.7835 3.4860 3.1496 3.6499 6.2221 4.4714 2.8209 4.5177 2.5852 2.4420 3.1855 2.6557 1.9627 2.5870 2.0668 3.1105 3.3117 4.0887 4.6549 1.9465 2.4815 3.1995 2.7628 1.2000 1.1547 2.3684 2.9847 2.7963 2.6013 3.0226 3.1102 3.8883 1.6112 2.8344 2.1899 3.3785 2.5870 4.7354 6.9042 4.0394 1.7693 4.4524 4.4161 1.5550 2.0250 1.4390 3.0067 3.2146 1.2636 4.4131 2.4479 1.8482 1.9879 1.5991 1.8485 1.6253 2.3997 1.9609 2.3456 1.8466 1.8342 2.3352 1.9482 1.3833 1.3504 3.0647 2.4138 1.4659 1.9956 1.7919 2.1082 1.6972 1.3477 2.3945 2.0695 2.4217 1.1938 2.4223 2.4860 2.8126 2.4638 1.2170 1.9496 2.2570 1.1348 1.5170 1.4632 1.2826 1.3196 1.2690 1.3444 1.4584 1.5487 1.5011 1.4854 1.3540 1.2126 1.2608 1.2882 1.3163 1.4142 1.3903 1.3310 2.8844 1.2904 1.3874 1.3632 1.3546 1.4685 1.4157 1.4305 1.3347 1.3857 1.3010 1.3479 1.4769 3.3933 4.1378 1.0817 1.0873 1.0954 1.0884 1.0836 1.0825 1.0821 1.0971 1.0930 1.0890 1.0843 1.0898 1.0894 3.1453 7.2266 8.8137 3.3377 1.4168 1.0711 1.0633 1.0623 1.0780 1.0716 1.0601 1.0659 1.0644 1.0682 1.0613 1.0619 1.0637 1.0608 1.0660 1.0993 1.0971 1.0946 1.0970 1.0785 1.1021 1.1001 1.1019 1.0796 1.1030 1.1023 1.1029 1.0903 1.1078 1.0894 1.0893 1.0952 1.0947 1.0450 1.1040
irintensity: 1.0036 0.0645 1.0707 0.3301 0.5360 0.9651 0.3260 0.8573 0.4645 1.1135 0.0447 1.3447 1.0539 3.6454 2.8382 0.3313 0.0222 0.0639 0.3566 3.5203 5.7142 10.3342 3.2707 0.1423 1.0361 5.3061 1.6604 237.7535 78.5935 0.5180 1.9986 3.2400 0.9923 3.0199 6.9486 4.7517 3.5337 2.0701 0.6293 11.0961 0.6272 16.7686 1.8078 25.3787 4.2415 3.5753 11.5587 7.2204 1.1035 0.6143 3.1910 8.7141 0.5224 0.0219 5.3848 70.2609 2.0816 3.7095 12.3885 15.1038 4.8235 39.5089 6.0775 1.2281 3.1359 9.9442 4.8922 0.3392 0.0656 15.3615 21.1449 9.8163 1.8143 2.3291 108.5724 114.4655 2.1211 96.9281 9.4164 30.4575 7.7493 70.9446 8.0140 7.1068 28.8105 15.7019 25.7705 19.5076 191.6094 2.9713 6.9933 8.1207 11.2925 14.2958 8.8814 83.1710 100.2396 92.5016 58.4302 4.2557 0.7345 1.9677 3.2369 1.9612 9.1932 2.9854 7.0207 106.5806 4.2284 1.5431 0.9887 1.8713 1.3483 5.0532 1.8912 4.6292 23.9239 13.4501 6.7303 0.0366 14.0912 7.6785 9.7636 1.7991 14.4152 5.0324 5.5566 11.5979 1.8848 8.0035 37.5099 7.9499 15.1171 8.8498 12.0124 77.1480 55.6184 418.9683 110.2011 332.1450 79.5481 33.3709 48.9709 11.1614 45.8841 16.9041 16.0156 57.9081 44.9275 49.8328 25.7886 60.8418 35.6794 14.5852 19.7916 87.2145 77.4311 42.6533 18.0734 33.7748 29.7131 72.1372 41.0140 61.5680 28.3119 138.4568 28.5434 16.0393 15.5761 25.2246 8.8422 4.0139 118.8749 22.8755
temp: 298.150 k
press: 1.00000 atm
elementType: 8 8 7 7 6 6 6 6 6 6 6 6 6 6 6 6 6 6 6 6 6 6 6 6 6 6 1 1 1 1 1 1 1 1 1 1 1 1 1 1 1 1 1 1 1 1 1 1 1 1 1 1 1 1 1 1 1 1 1 1
symmnumber: 1
zpe: 1378255.2 jmol-1
zpe.correction: 0.524950 hartree
zpe.thermalcorrener: 0.551146 hartree
zpe.thermalcorrenthalpy: 0.552090 hartree
zpe.thermalcorrgfe: 0.465899 hartree
zpe.sumelectzpe: -1116.677302 hartree
zpe.sumelectthermal: -1116.651105 hartree
zpe.sumelectthermalent: -1116.650161 hartree
zpe.sumelectthermalfe: -1116.736353 hartree
dipole: 4.0657 -1.4589 -0.9982
dipole: 4.4333
quadrupole: -99.1948 -153.2443 -162.2805
quadrupole: -1.5060 -5.6518 -2.4332
quadrupole: 39.0451 -15.0044 -24.0407 -1.5060 -5.6518 -2.4332
hfenergy: -1117.2022515 hartree
pointgroup: C01 [X(C22H34N2O2)]
dipole: 1.4707697 0.3243652 0.8797186 debye
polarizability: 364.2739462|-10.8928178|234.6925911|27.7149099|30.4131945|205.3504015 unknown
InChI: InChI=1S/C22H34N2O2/c23-19-14-12-18(13-15-19)22(25)26-17-7-16-24(20-8-3-1-4-9-20)21-10-5-2-6-11-21/h12-15,20-21H,1-11,16-17,23H2
charge 0 multiplicity 1
60 atoms
O  1.770184 1.614098 0.797585
O  1.869613 -0.489559 -0.221229
N  -2.188138 -0.104839 -0.002953
N  7.957421 0.33395 1.913812
C  -3.518694 0.436532 0.387923
C  -2.177616 -1.204792 -1.016014
C  -4.549007 -0.593669 0.942701
C  -4.159796 1.26206 -0.772865
C  -2.111703 -2.652116 -0.435378
C  -1.042646 -0.99359 -2.051577
C  -5.767929 0.134141 1.583396
C  -5.7058 1.375144 -0.649756
C  -2.149383 -3.716485 -1.561147
C  -1.068989 -2.06599 -3.168044
C  -1.207444 -0.194998 1.103166
C  -6.132847 1.45318 0.833883
C  -1.007602 -3.495331 -2.580007
C  -0.615355 1.187757 1.48009
C  0.330114 1.771622 0.411665
C  2.435085 0.445968 0.408961
C  3.857905 0.452229 0.818755
C  4.661805 -0.676453 0.500083
C  4.45266 1.540823 1.513447
C  6.015755 -0.722648 0.859309
C  5.806889 1.50583 1.877547
C  6.614142 0.37181 1.556038
H  -3.320258 1.140761 1.222373
H  -3.139028 -1.129328 -1.567005
H  -4.889992 -1.250121 0.118228
H  -4.06556 -1.248524 1.693107
H  -3.700671 2.269607 -0.778597
H  -3.896459 0.798899 -1.742248
H  -1.169496 -2.776618 0.135594
H  -2.945832 -2.816172 0.272989
H  -1.152918 0.018719 -2.487004
H  -0.063103 -1.018084 -1.536248
H  -5.550091 0.362979 2.645261
H  -6.638757 -0.550137 1.583902
H  -6.19007 0.493652 -1.115932
H  -6.065362 2.260666 -1.208639
H  -3.124785 -3.659942 -2.089585
H  -2.084026 -4.731717 -1.12193
H  -0.225606 -1.901315 -3.866794
H  -2.002262 -1.960366 -3.761816
H  -1.647726 -0.654612 2.021979
H  -0.375044 -0.845033 0.785068
H  -5.619121 2.314864 1.305934
H  -7.218154 1.651725 0.920837
H  -1.063509 -4.249712 -3.38941
H  -0.032417 -3.636772 -2.070346
H  -0.061675 1.115519 2.437403
H  -1.44272 1.902466 1.655218
H  0.15428 1.296766 -0.569083
H  0.227181 2.865013 0.324023
H  4.196577 -1.510577 -0.035897
H  3.837052 2.410718 1.759019
H  6.622568 -1.600353 0.605715
H  6.253521 2.353178 2.41195
H  8.388142 1.110339 2.407743
H  8.535799 -0.469161 1.684001
