program: Gaussian 09
title: 000231821
version: EM64L-G09RevD.01
frameworkgroup: C1[X(C13H12O4)]
method: RPBEPBE
basis: SDD
operation: Freq
keyword: #pfreq=noraman
keyword: PBEPBE/SDD
title: #p freq=noraman PBEPBE/SDD
converged: YES YES NO NO
title: Mulliken charges:
elementType: O O O O C C C C C C C C C C C C C H H H H H H H H H H H H
charge: -0.218626 -0.254753 -0.438464 -0.232714 -0.553482 0.169599 -0.304276 -0.351164 0.340771 0.163329 -0.495680 0.120501 0.325887 -0.405574 -0.356034 0.088831 -0.783509 0.249550 0.245800 0.233789 0.229670 0.262695 0.331590 0.224317 0.283819 0.251767 0.248498 0.254238 0.369627
chargesum: 0.00000
title: Mulliken charges with hydrogens summed into heavy atoms:
elementType: O O O O C C C C C C C C C C C C C
charge: -0.218626 -0.254753 -0.068837 -0.232714 -0.058132 0.169599 0.159182 -0.088469 0.340771 0.163329 -0.164090 0.120501 0.325887 -0.181257 -0.072215 0.088831 -0.029006
polarizability: 2.56756857e+02 -4.70229226e+00 1.81776465e+02 -2.01023110e+00 8.65594676e-01 7.37523606e+01
1716.lowfreq: -7.2468 -5.5967 -0.0008 0.0006 0.0009 4.2575 36.0003 46.0600 65.9256
frequency: 35.9784 46.0451 65.9193 84.6789 101.6038 120.4596 134.7886 171.3747 194.7180 223.2148 245.8711 261.7099 323.3804 331.8814 370.8887 393.2955 429.2846 459.3087 478.2103 497.7710 512.9450 563.0438 594.8747 628.8316 653.1128 659.0495 669.9549 721.2474 742.1817 761.0597 793.3617 825.6301 842.6429 921.6311 937.3727 950.4714 955.4843 973.0397 993.2100 995.5875 1017.3745 1027.7184 1058.6326 1071.0403 1097.5496 1152.7051 1161.0667 1169.1292 1190.3114 1203.7014 1248.7884 1281.9690 1287.1647 1331.9421 1339.1061 1373.8416 1385.6630 1403.7696 1430.3595 1443.7708 1457.4703 1457.7385 1487.0587 1492.7015 1570.2831 1601.1941 1602.9492 1634.8412 1655.1769 2990.3286 2991.8483 3022.8135 3071.4804 3072.1016 3107.6421 3111.6100 3116.1248 3127.1767 3145.9198 3160.4257 3582.4721
redmass: 4.3049 5.2383 3.8537 6.0595 5.1137 1.6059 1.6556 3.5976 5.3352 6.0310 4.3950 5.5981 4.2602 5.5220 3.5951 1.1270 4.9663 5.9299 3.1931 4.3859 3.3274 5.5778 6.3137 2.6872 5.3614 3.4258 6.0743 6.6272 6.9400 4.0554 6.1658 1.4479 1.7103 4.6707 3.1075 1.6045 1.9526 1.4010 1.8008 2.3834 4.0352 1.8393 1.6529 2.3276 2.0792 2.1434 1.3972 1.2421 1.6362 1.5763 2.3894 1.9044 2.1494 1.4549 1.3461 1.2830 2.4112 5.0818 2.0640 1.1068 1.0483 1.0887 1.0903 2.6386 6.3553 6.9858 7.5106 7.7492 8.7748 1.0378 1.0652 1.0637 1.0971 1.0960 1.0871 1.1058 1.0898 1.1000 1.0945 1.0947 1.0661
irintensity: 6.8570 0.0382 5.5902 2.0306 1.1034 1.2615 2.0157 6.1015 9.9452 6.0080 1.0695 1.2091 2.3316 1.1951 1.0491 138.5244 3.2881 7.4005 2.4014 0.6846 1.7676 30.9716 9.6724 15.0018 4.5261 1.6949 1.7593 8.0892 7.0314 3.7761 17.2546 49.8433 17.8099 3.0838 12.9552 5.7063 53.5898 17.1229 72.9242 175.1753 133.1333 0.0497 21.7981 103.6249 122.9999 164.1283 33.5700 12.9659 11.6213 24.0674 24.3729 118.0690 211.0050 6.4875 0.4600 44.4286 35.3367 52.7572 57.6456 29.2601 20.6771 10.1481 4.3825 13.6737 106.8778 77.0688 61.3044 164.8618 147.0349 1.3556 19.7230 63.6576 19.0266 8.4388 12.9423 26.3239 17.3178 21.5623 51.2261 5.5358 58.1401
temp: 298.150 k
press: 1.00000 atm
elementType: 8 8 8 8 6 6 6 6 6 6 6 6 6 6 6 6 6 1 1 1 1 1 1 1 1 1 1 1 1
symmnumber: 1
zpe: 578993.0 jmol-1
zpe.correction: 0.220527 hartree
zpe.thermalcorrener: 0.236105 hartree
zpe.thermalcorrenthalpy: 0.237049 hartree
zpe.thermalcorrgfe: 0.176665 hartree
zpe.sumelectzpe: -802.247671 hartree
zpe.sumelectthermal: -802.232093 hartree
zpe.sumelectthermalent: -802.231149 hartree
zpe.sumelectthermalfe: -802.291533 hartree
dipole: 3.6888 6.6926 0.0532
dipole: 7.6421
quadrupole: -99.2222 -91.0571 -99.1938
quadrupole: -3.7895 0.5988 0.8169
quadrupole: -2.7312 5.4339 -2.7028 -3.7895 0.5988 0.8169
hfenergy: -802.468198 hartree
pointgroup: C01 [X(C13H12O4)]
dipole: -1.8909572 -2.2855456 -0.4902349 debye
polarizability: 250.1577472|-20.0197046|184.7805203|18.7315249|11.2094168|77.3474144 unknown
InChI: InChI=1S/C13H12O4/c1-8(14)9-2-3-12(15)11(6-9)7-10-4-5-17-13(10)16/h2-3,6-7,15H,4-5H2,1H3
charge 0 multiplicity 1
29 atoms
O  -3.276686 2.421976 -0.126508
O  -0.96888 2.437773 -0.1103
O  -0.276723 -3.252527 -0.665039
O  4.55495 0.856141 0.4706
C  -3.744025 0.169013 -0.857157
C  -2.253846 0.332006 -0.564302
C  -4.375915 1.413862 -0.193433
C  -1.377436 -0.728913 -0.610287
C  0.065636 -0.868267 -0.392466
C  -2.020357 1.773553 -0.249938
C  0.976979 0.199373 -0.156316
C  0.613936 -2.194965 -0.431101
C  2.358737 -0.026194 0.038913
C  1.995283 -2.432941 -0.237556
C  2.862699 -1.355889 -0.002023
C  3.323026 1.099177 0.292732
C  2.79182 2.525606 0.332004
H  -3.923196 0.183325 -1.949556
H  -4.159881 -0.771624 -0.459373
H  -5.194215 1.869879 -0.770435
H  -4.708788 1.21722 0.841208
H  -1.852307 -1.690653 -0.850037
H  0.572573 1.214843 -0.132732
H  2.38334 -3.459351 -0.270803
H  3.935852 -1.508618 0.152898
H  2.021416 2.645891 1.115943
H  2.309463 2.799807 -0.624425
H  3.625941 3.215086 0.530551
H  0.196803 -4.120887 -0.679461
