program: Gaussian 09
title: 000231824
version: EM64L-G09RevD.01
frameworkgroup: C1[X(C13H16O4)]
method: RPBEPBE
basis: SDD
operation: Freq
keyword: #pfreq=noraman
keyword: PBEPBE/SDD
title: #p freq=noraman PBEPBE/SDD
converged: YES YES NO NO
title: Mulliken charges:
elementType: O O O O C C C C C C C C C C C C C H H H H H H H H H H H H H H H H
charge: -0.284396 -0.284402 -0.195803 -0.195848 0.048002 -0.523653 -0.523689 0.238558 0.238593 0.246060 0.246074 -0.261978 -0.262038 -0.660699 -0.660650 -0.516834 -0.516891 0.239422 0.258120 0.258126 0.239436 0.236433 0.220039 0.236525 0.220053 0.213543 0.230313 0.258730 0.213531 0.230355 0.258652 0.278156 0.278161
chargesum: 0.00000
title: Mulliken charges with hydrogens summed into heavy atoms:
elementType: O O O O C C C C C C C C C C C C C
charge: -0.284396 -0.284402 -0.195803 -0.195848 0.048002 -0.026111 -0.026128 0.238558 0.238593 0.246060 0.246074 0.194494 0.194540 0.041887 0.041887 -0.238678 -0.238730
polarizability: 1.58646212e+02 -1.70727156e+01 1.54551274e+02 5.05605792e-03 -6.81704218e-03 1.19189349e+02
1716.lowfreq: -14.3785 -8.8950 -4.2798 -0.0008 -0.0005 0.0007 18.4642 21.1375 41.0059
frequency: 17.1700 18.3757 40.9906 47.2206 55.1526 71.5635 89.7439 95.6448 103.0346 125.5921 147.8551 192.0556 211.6905 228.5568 240.6123 246.8716 266.4060 275.0088 311.6790 315.4040 324.5718 329.1568 376.3127 405.8536 425.5971 446.7967 557.8239 564.3943 637.3516 638.0549 649.4757 652.8515 653.5055 698.0096 745.7071 750.0582 758.0382 815.1165 816.2631 839.9440 860.7424 904.7042 906.1238 988.5834 995.0493 1009.6430 1028.7473 1049.5650 1074.4682 1096.9716 1097.9629 1138.8167 1141.8183 1156.4118 1156.7299 1198.7618 1276.0809 1276.3571 1283.9604 1311.0950 1329.3301 1353.1212 1353.6886 1391.0798 1391.1565 1434.5079 1449.2157 1455.9718 1456.5192 1461.7039 1461.7889 1485.4771 1485.5241 1633.4704 1668.9837 2149.6561 2150.0157 2990.7822 2994.3042 2994.4441 2994.5105 3028.5242 3028.6972 3050.9756 3054.6375 3090.2133 3090.2818 3094.7452 3094.7974 3120.5626 3120.6321 3428.7782 3429.0237
redmass: 3.4283 4.0878 4.2169 3.4463 3.8507 3.3785 3.9580 4.9466 6.2897 4.8386 3.2894 1.6501 2.0358 1.7824 2.3459 2.6937 3.9499 5.7500 3.2627 2.7812 2.8429 2.7846 5.3371 7.8164 3.5138 3.3119 8.1638 5.7055 1.3378 1.2308 2.2008 1.3709 1.2523 6.0069 4.7966 2.8693 2.8326 1.4874 1.4568 3.4845 2.4633 6.0887 1.8472 2.3996 3.5333 2.7998 4.5196 4.4738 9.0390 2.1548 2.1513 2.0999 6.8695 1.6643 1.6864 1.0515 1.1165 1.1186 1.3334 1.6922 1.3930 1.2940 1.2889 1.2284 1.2283 1.0917 1.0875 1.0907 1.0882 1.0460 1.0467 1.0509 1.0506 10.7571 11.0624 6.0298 6.0294 1.0594 1.0588 1.0362 1.0364 1.0593 1.0593 1.1006 1.1000 1.0976 1.0976 1.1038 1.1038 1.1055 1.1055 1.1596 1.1596
irintensity: 0.5493 1.2907 0.0006 1.9483 0.3560 0.0427 1.4887 0.1988 0.0728 2.2501 0.8964 4.2825 0.0001 0.1223 0.2249 0.2043 0.5710 2.7557 29.9253 0.0051 0.0362 3.8468 8.5023 1.1339 2.6907 1.3506 21.8126 17.0110 112.6026 3.0582 31.6216 42.0920 95.1419 5.7828 8.1186 4.3503 0.7096 5.6715 0.1288 2.8736 0.2909 1.0813 0.1484 55.1979 0.0022 12.2565 573.0218 4.8259 1.1782 39.5319 0.2179 275.9134 0.8337 3.9956 3.7324 0.0139 4.0088 0.8801 0.4631 61.1169 3.7402 0.4963 1.4710 26.4818 21.4376 2.0945 26.8924 19.2026 9.2498 11.1592 14.0436 9.2863 20.3842 63.0875 188.5175 0.0645 4.6352 6.1696 25.9861 25.4179 7.2076 49.8951 14.9334 0.0209 8.9929 57.5838 10.1628 0.7702 0.8141 26.7716 30.4932 108.9511 16.9684
temp: 298.150 k
press: 1.00000 atm
elementType: 8 8 8 8 6 6 6 6 6 6 6 6 6 6 6 6 6 1 1 1 1 1 1 1 1 1 1 1 1 1 1 1 1
symmnumber: 1
zpe: 675024.1 jmol-1
zpe.correction: 0.257103 hartree
zpe.thermalcorrener: 0.277245 hartree
zpe.thermalcorrenthalpy: 0.278189 hartree
zpe.thermalcorrgfe: 0.205918 hartree
zpe.sumelectzpe: -804.453431 hartree
zpe.sumelectthermal: -804.433289 hartree
zpe.sumelectthermalent: -804.432345 hartree
zpe.sumelectthermalfe: -804.504615 hartree
dipole: 0.0013 -0.0030 2.5234
dipole: 2.5234
quadrupole: -78.8464 -95.6964 -103.1012
quadrupole: 2.5442 -0.0050 -0.0008
quadrupole: 13.7016 -3.1484 -10.5532 2.5442 -0.0050 -0.0008
hfenergy: -804.7105336 hartree
pointgroup: C01 [X(C13H16O4)]
dipole: -0.0016065 -0.0201738 -0.992574 debye
polarizability: 154.733606|17.0897377|158.4490394|-0.3653209|-0.7622984|119.204189 unknown
InChI: InChI=1S/C13H16O4/c1-5-9-13(10-6-2,11(14)16-7-3)12(15)17-8-4/h1-2H,7-10H2,3-4H3
charge 0 multiplicity 1
33 atoms
O  2.385641 -0.261288 -0.650063
O  -2.389439 0.245812 -0.653207
O  1.128903 -0.900656 1.206164
O  -1.127668 0.954037 1.17444
C  -0.002142 -0.011046 -0.829223
C  0.34821 1.18521 -1.79246
C  -0.35494 -1.242378 -1.745996
C  1.192073 -0.41413 0.061856
C  -1.193975 0.425433 0.049075
C  0.710024 2.440114 -1.117493
C  -0.71475 -2.471161 -1.023555
C  3.63876 -0.651738 0.071166
C  -3.640925 0.66053 0.057379
C  4.121482 0.491993 0.966858
C  -4.119529 -0.451728 0.993853
C  1.013609 3.506832 -0.581135
C  -1.016622 -3.517074 -0.446782
H  -0.529692 1.354282 -2.446009
H  1.190274 0.863148 -2.431426
H  -1.19866 -0.944219 -2.394257
H  0.52119 -1.435811 -2.395138
H  3.432631 -1.5648 0.657236
H  4.345908 -0.871715 -0.744509
H  -3.433907 1.593709 0.610483
H  -4.350679 0.851074 -0.76343
H  5.090619 0.220656 1.425374
H  4.258853 1.417761 0.3823
H  3.397798 0.685518 1.775585
H  -5.08799 -0.165974 1.444966
H  -4.256682 -1.397657 0.442467
H  -3.393522 -0.615691 1.807055
H  1.268126 4.427901 -0.089752
H  -1.269682 -4.419145 0.079376
