program: Gaussian 09
title: 000231792
version: EM64L-G09RevD.01
frameworkgroup: C1[X(C8H17NO2)]
method: RPBEPBE
basis: SDD
operation: Freq
keyword: #p
keyword: freq=noraman
keyword: PBEPBE/SDD
title: #p freq=noraman PBEPBE/SDD
converged: YES YES NO NO
title: Mulliken charges:
elementType: O O N C C C C C C C C H H H H H H H H H H H H H H H H H
charge: -0.305145 -0.296716 -0.382383 -0.348691 -0.039025 -0.345358 -0.294678 -0.661889 -0.703097 -0.688565 0.289296 0.225414 0.198888 0.242681 0.190223 0.202558 0.213327 0.228157 0.315951 0.209359 0.200199 0.247782 0.234101 0.223007 0.203431 0.209725 0.215164 0.216284
chargesum: 0.00000
title: Mulliken charges with hydrogens summed into heavy atoms:
elementType: O O N C C C C C C C C
charge: -0.305145 -0.296716 -0.066432 0.075611 0.203657 0.047423 0.146806 -0.004548 -0.042559 -0.047392 0.289296
polarizability: 1.33820228e+02 -4.49583484e+00 8.62165456e+01 -4.99902224e-01 -2.01754096e+00 8.86384239e+01
1716.lowfreq: -13.8602 -8.8936 0.0004 0.0007 0.0009 4.2519 15.0010 37.6772 50.6827
frequency: 14.8937 37.3434 50.6726 66.7631 91.9321 106.0326 147.3867 188.9348 209.2636 226.9675 245.3499 264.7956 294.1000 360.2670 394.8155 405.1801 444.8865 525.8698 534.7309 648.0392 699.7890 743.5572 800.9719 834.0098 877.2370 898.5561 917.7487 932.7252 940.5163 947.5628 1018.1508 1047.6163 1077.6842 1115.3339 1139.8726 1150.7402 1165.3531 1186.9774 1208.4075 1227.6350 1272.1242 1290.5654 1291.7964 1312.0364 1345.0825 1351.0603 1370.2685 1375.1706 1388.8451 1392.9262 1450.6591 1461.9436 1466.5438 1469.8986 1471.6070 1475.6960 1478.2683 1483.7831 1487.4154 1489.7423 1661.1814 2967.1492 2974.8183 2975.7458 2980.0174 2989.3727 3012.2326 3016.2310 3022.4057 3049.1247 3069.3035 3072.4365 3074.3730 3080.4784 3091.9499 3093.9240 3095.1108 3559.1388
redmass: 2.8823 3.7936 6.1378 1.6251 3.7334 2.4690 2.8808 3.5575 1.0262 1.1229 1.1088 3.3261 3.2904 2.8648 3.0989 2.8589 2.5454 4.0065 1.1745 4.6953 11.7132 1.0738 1.1894 2.8785 3.5938 1.7866 1.2743 1.9904 1.2337 1.6599 3.4304 4.0076 2.4122 2.4777 2.1574 2.0935 1.7660 2.3248 2.2685 1.3158 1.2773 1.0919 1.1203 1.5128 1.3791 1.3058 1.3407 1.2150 1.2142 1.2317 1.1222 1.0981 1.0555 1.2495 1.0696 1.0432 1.0600 1.0802 1.2507 1.1141 9.3829 1.0587 1.0365 1.0373 1.0365 1.0600 1.0993 1.0578 1.0850 1.1029 1.0984 1.1009 1.0997 1.0988 1.1002 1.1082 1.0999 1.0772
irintensity: 0.0284 0.3127 8.8647 0.1890 0.4099 0.4328 2.1810 1.4488 0.0375 0.5260 0.1945 1.0301 21.2124 2.8513 5.4348 6.0577 0.1429 0.1784 115.1178 10.3590 19.6976 9.4663 0.2964 3.9765 4.7333 11.3076 6.5900 13.8162 0.4025 6.4649 74.4036 202.6370 9.2605 13.1456 27.2351 38.3629 9.6012 1.4987 226.9640 1.8044 5.6765 1.8632 0.6399 28.3640 1.8914 13.0149 9.0361 24.0881 8.5997 32.1103 14.8973 66.8238 14.7459 159.6937 0.3489 11.9828 2.2257 60.9883 70.8887 53.1501 264.4667 32.2051 32.1009 23.4683 28.0284 23.4929 8.9220 54.7715 1.7959 7.9394 8.6793 59.4272 53.4155 67.5711 19.4549 48.6093 39.8492 29.4832
temp: 298.150 k
press: 1.00000 atm
elementType: 8 8 7 6 6 6 6 6 6 6 6 1 1 1 1 1 1 1 1 1 1 1 1 1 1 1 1 1
symmnumber: 1
zpe: 640594.8 jmol-1
zpe.correction: 0.243990 hartree
zpe.thermalcorrener: 0.258197 hartree
zpe.thermalcorrenthalpy: 0.259141 hartree
zpe.thermalcorrgfe: 0.200830 hartree
zpe.sumelectzpe: -519.357727 hartree
zpe.sumelectthermal: -519.343520 hartree
zpe.sumelectthermalent: -519.342576 hartree
zpe.sumelectthermalfe: -519.400887 hartree
dipole: -0.8946 0.8862 -1.7777
dipole: 2.1785
quadrupole: -56.0821 -68.7338 -71.0764
quadrupole: -3.2955 0.6571 1.3613
quadrupole: 9.2154 -3.4364 -5.7790 -3.2955 0.6571 1.3613
hfenergy: -519.6017171 hartree
pointgroup: C01 [X(C8H17N1O2)]
dipole: -0.3131812 -0.7675422 -0.2177481 debye
polarizability: 133.1747529|1.9899602|89.4235006|6.7931901|1.650733|86.0769439 unknown
InChI: InChI=1S/C8H17NO2/c1-4-5-6-11-8(10)9-7(2)3/h7,9H,4-6H2,1-3H3
charge 0 multiplicity 1
28 atoms
O  0.369153 -1.111842 0.638347
O  -0.405697 1.112634 0.400038
N  -1.724547 -0.747008 -0.169906
C  2.628946 -0.327535 -0.07995
C  -2.93613 0.015761 -0.543142
C  4.019216 0.1532 0.399693
C  1.681736 -0.586552 1.099546
C  -3.802992 0.334956 0.698582
C  -3.719618 -0.767174 -1.615518
C  4.992624 0.401919 -0.772734
C  -0.586956 -0.130193 0.292078
H  2.179236 0.437888 -0.74064
H  2.738347 -1.256058 -0.673838
H  -2.579169 0.971447 -0.969665
H  4.45486 -0.599915 1.088126
H  3.901916 1.085919 0.987585
H  2.066426 -1.379399 1.763668
H  1.510638 0.341241 1.675516
H  -1.746246 -1.768018 -0.170524
H  -4.672212 0.956565 0.415202
H  -4.17894 -0.594169 1.166308
H  -3.209545 0.890724 1.444759
H  -3.093687 -0.96103 -2.504478
H  -4.607046 -0.192763 -1.933625
H  -4.076212 -1.737817 -1.218443
H  5.148715 -0.521953 -1.360799
H  4.595919 1.173446 -1.458764
H  5.979563 0.744726 -0.411723
