program: Gaussian 09
title: 000231803
version: EM64L-G09RevD.01
frameworkgroup: C1[X(C13H5Cl6NO2)]
method: RPBEPBE
basis: SDD
operation: Freq
keyword: #p
keyword: freq=noraman
keyword: PBEPBE/SDD
title: #p freq=noraman PBEPBE/SDD
converged: NO YES NO YES
title: Mulliken charges:
elementType: Cl Cl Cl Cl Cl Cl O O N C C C C C C C C C C C C C H H H H H
charge: 0.060041 0.060041 0.063743 0.063743 0.070047 -0.054866 -0.334677 -0.212183 -0.454219 0.742358 -0.309795 -0.309777 0.523226 -0.085795 -0.085791 -0.117278 -0.431629 -0.352278 0.249707 -0.047649 -0.190778 -0.248759 0.348336 0.255925 0.299797 0.237494 0.261014
chargesum: 0.00000
title: Mulliken charges with hydrogens summed into heavy atoms:
elementType: Cl Cl Cl Cl Cl Cl O O N C C C C C C C C C C C C C
charge: 0.060041 0.060041 0.063743 0.063743 0.070047 -0.054866 -0.334677 -0.212183 -0.105882 0.742358 -0.309795 -0.309777 0.523226 -0.085795 -0.085791 -0.117278 -0.175704 -0.052481 0.249707 -0.047649 0.046716 0.012255
polarizability: 3.41391577e+02 5.93463613e-03 1.92001193e+02 -2.02145340e+01 -2.88735522e-03 1.40443024e+02
1716.lowfreq: -6.8223 -0.0029 -0.0012 0.0017 2.1623 3.2427 10.1402 13.8248 27.4894
frequency: 7.1291 13.8059 27.4882 58.1391 68.1359 70.3488 74.8505 88.4568 108.6054 163.1957 182.5527 196.3992 200.9298 202.5361 213.4674 230.4548 238.5415 245.7943 293.0968 316.2113 318.5723 327.4188 350.6896 358.6228 366.1672 409.2713 438.3016 464.9063 559.5333 571.8115 592.4781 610.8801 615.7368 643.6879 663.1630 669.7574 683.4706 695.6372 695.6442 739.2692 788.2434 791.3822 824.1521 862.5650 867.2782 883.1849 909.7701 959.8038 980.1192 987.5438 1067.6588 1075.4558 1099.9206 1135.3074 1183.7719 1231.4404 1251.4481 1308.8521 1328.4686 1336.9773 1358.4732 1380.6475 1414.8018 1475.6259 1514.0814 1535.0430 1547.3522 1591.3966 1612.9930 1720.2283 3148.2128 3151.2428 3181.2108 3195.3945 3538.5061
redmass: 8.1727 19.5406 18.4940 10.3231 23.2776 17.8344 6.7860 19.3462 18.6126 12.7285 5.4141 22.9465 30.4877 21.2837 34.6933 12.4020 11.8343 4.3905 17.2327 16.9389 14.7097 27.9206 14.2698 18.5338 7.1982 8.5099 3.0529 12.4944 4.3063 11.1879 12.0817 12.4049 8.6971 2.3539 7.7272 8.4458 2.2964 9.8700 2.4940 11.6656 11.7427 1.3280 12.8561 6.0641 1.5644 10.5508 1.3732 11.5325 5.9871 1.3203 10.8764 2.1207 1.5700 3.7913 1.0881 8.5945 1.8936 1.5264 12.0384 12.0122 7.1945 7.3921 2.9332 2.5821 2.2885 11.9988 9.4599 4.9440 6.5521 10.3942 1.0926 1.0889 1.0950 1.0961 1.0764
irintensity: 0.0173 0.0139 0.0030 1.6878 0.0132 0.1375 3.1149 0.4950 0.4021 2.7226 0.6794 0.4673 0.0573 0.4571 0.0011 7.0790 2.0092 2.4892 0.6640 0.1783 0.1321 0.0309 0.4080 0.1998 3.9052 8.1788 7.1657 19.9703 2.7801 1.6056 0.0208 6.8829 4.5690 33.3889 39.0284 5.2183 33.8171 14.1539 59.1905 120.8778 2.8585 53.6815 0.0133 92.0545 43.8278 88.0287 3.0634 304.6521 8.3108 2.1487 158.4656 31.6912 35.0676 400.7262 0.7749 7.2603 6.5590 53.0706 124.4756 39.0956 522.1218 1.3400 64.4812 105.2862 364.1184 0.4779 18.8005 157.0125 152.8352 301.7983 4.9288 6.7698 2.0352 3.8744 41.8900
temp: 298.150 k
press: 1.00000 atm
elementType: 17 17 17 17 17 17 8 8 7 6 6 6 6 6 6 6 6 6 6 6 6 6 1 1 1 1 1
symmnumber: 1
zpe: 394849.7 jmol-1
zpe.correction: 0.150390 hartree
zpe.thermalcorrener: 0.171537 hartree
zpe.thermalcorrenthalpy: 0.172481 hartree
zpe.thermalcorrgfe: 0.094951 hartree
zpe.sumelectzpe: -3462.380604 hartree
zpe.sumelectthermal: -3462.359458 hartree
zpe.sumelectthermalent: -3462.358514 hartree
zpe.sumelectthermalfe: -3462.436044 hartree
dipole: 0.9736 -0.0001 -0.7500
dipole: 1.2290
quadrupole: -170.8600 -169.6533 -161.2979
quadrupole: -0.0012 6.5320 -0.0003
quadrupole: -3.5896 -2.3829 5.9725 -0.0012 6.5320 -0.0003
hfenergy: -3462.5309944 hartree
pointgroup: C01 [X(C13H5Cl6N1O2)]
dipole: -0.3729625 -0.0000519 0.3077163 debye
polarizability: 339.8131181|-0.0007624|192.0011929|-26.8947008|-0.0013105|142.0214833 unknown
InChI: InChI=1S/C13H5Cl6NO2/c14-5-2-1-3-6(4-5)20-13(21)22-12-10(18)8(16)7(15)9(17)11(12)19/h1-4,20H
charge 0 multiplicity 1
27 atoms
Cl 1.479811 2.754463 0.604854
Cl 1.48034 -2.754303 0.605344
Cl 4.631783 -2.785763 -0.156518
Cl 4.631253 2.786392 -0.156996
Cl 6.197003 0.000431 -0.533613
Cl -6.978988 0.000043 1.466768
O  0.363926 0.000011 0.972703
O  -0.381248 -0.000374 -1.286859
N  -1.859507 -0.000193 0.576408
C  1.704897 0.000098 0.558976
C  2.391148 1.222969 0.388566
C  2.391382 -1.222672 0.388778
C  -3.153126 -0.000267 -0.018165
C  3.763649 -1.227071 0.054556
C  3.763415 1.227571 0.054346
C  4.450399 0.000301 -0.111606
C  -4.264874 -0.000098 0.865179
C  -3.355385 -0.000504 -1.422731
C  -0.648093 -0.000285 -0.071521
C  -5.560273 -0.000173 0.32315
C  -4.673987 -0.000569 -1.924243
C  -5.79619 -0.000406 -1.064894
H  -1.806367 -0.000046 1.597926
H  -4.122711 0.000086 1.951294
H  -2.498637 -0.000632 -2.099057
H  -4.832669 -0.000752 -3.007568
H  -6.815551 -0.000458 -1.459081
