program: Gaussian 09
title: 000231813
version: EM64L-G09RevD.01
frameworkgroup: C1[X(C13H16ClNO3)]
method: RPBEPBE
basis: SDD
operation: Freq
keyword: #p
keyword: freq=noraman
keyword: PBEPBE/SDD
title: #p freq=noraman PBEPBE/SDD
converged: YES YES NO NO
title: Mulliken charges:
elementType: Cl O O O N C C C C C C C C C C C C C H H H H H H H H H H H H H H H H
charge: -0.063909 -0.275426 -0.309973 -0.273318 -0.468553 -0.018030 -0.464911 -0.475689 -0.292908 -0.325739 0.256628 0.330331 0.277072 -0.296322 -0.372306 -0.841785 -0.103993 -0.265338 0.234029 0.221826 0.253848 0.239804 0.234312 0.222620 0.200978 0.245305 0.245009 0.356591 0.324118 0.234901 0.233840 0.246797 0.233433 0.256759
chargesum: 0.00000
title: Mulliken charges with hydrogens summed into heavy atoms:
elementType: Cl O O O N C C C C C C C C C C C C C
charge: -0.063909 -0.275426 -0.309973 -0.273318 -0.111962 0.215999 0.010762 -0.001573 0.130690 0.164574 0.256628 0.330331 0.277072 0.027796 -0.137406 -0.127715 -0.103993 -0.008579
polarizability: 2.30775040e+02 -3.54016184e+00 1.82425445e+02 1.41743142e+01 6.88341526e+00 9.87330036e+01
1716.lowfreq: -9.1460 -3.6676 -0.0020 -0.0015 -0.0008 5.7454 18.4479 23.3949 30.9772
frequency: 16.6042 23.3824 30.9362 66.7515 71.1834 88.6971 112.2407 116.1946 183.1066 198.3117 199.4024 232.2340 242.9303 257.0256 283.4018 319.0476 329.4093 359.4426 386.6522 439.1389 449.3337 460.5571 576.5286 588.4959 603.7716 624.6725 642.4438 671.7699 689.0425 697.3564 719.3172 775.3114 804.9276 816.8821 829.8979 858.8371 875.3456 885.0119 906.2305 913.0503 917.4793 938.5770 981.1777 988.6759 994.4780 1014.9190 1026.0540 1043.7421 1082.7303 1086.9828 1129.0393 1130.2478 1153.5109 1161.5645 1173.1824 1187.4146 1220.0791 1235.3237 1260.8037 1267.9787 1275.4029 1300.3429 1311.4122 1328.3400 1341.3268 1367.0665 1375.5279 1398.5846 1414.9749 1453.2290 1457.0887 1464.0796 1476.2871 1482.3215 1485.8165 1489.6998 1518.0709 1591.2350 1612.1746 1663.9026 2958.9659 2979.4450 3012.9437 3019.1010 3028.2217 3030.8039 3040.5745 3065.7642 3085.9549 3091.2920 3098.2370 3120.0159 3135.2949 3178.2158 3191.4925 3550.8729
redmass: 4.5930 3.6907 4.5497 4.9496 9.1222 4.4210 4.2609 4.8047 4.5152 2.8922 1.2097 3.6179 2.8277 4.9272 4.7162 3.8376 5.1578 9.9588 2.5455 3.6077 2.9967 3.5610 3.9872 1.9966 5.5831 6.3034 1.3939 5.7582 5.7944 5.7058 3.4305 5.1824 1.2903 2.3313 2.7689 2.2607 5.3814 1.8623 5.2641 1.3658 2.6459 1.3413 1.8930 1.6539 2.5783 3.0882 3.3026 1.5111 2.1384 1.4661 1.6925 1.4419 1.5719 2.7815 1.8425 2.1642 1.2992 1.2407 1.2342 2.2917 1.3809 1.3924 1.2583 1.2940 1.3195 1.4874 4.6170 1.3577 3.0232 1.3775 1.4385 1.0998 1.0911 1.0453 1.3556 1.0956 2.1755 5.6708 6.2147 7.8084 1.0400 1.0647 1.0692 1.0620 1.0979 1.0799 1.0601 1.0997 1.1016 1.0950 1.1047 1.1085 1.0900 1.0956 1.0930 1.0755
irintensity: 1.9520 1.1060 0.4588 2.7481 4.8808 0.0908 0.5358 0.7593 0.9334 1.5060 0.6114 1.0232 6.6743 3.9614 1.6969 3.2128 31.0101 5.4585 4.8849 4.7833 13.3992 11.9857 0.1203 5.4489 7.8901 12.5898 43.9552 0.4562 10.5709 46.6338 11.1019 5.8518 42.2016 11.3483 10.0566 4.3980 69.0080 2.5097 25.3098 29.2304 15.0328 0.5933 92.4832 12.5192 50.9579 188.6355 97.4716 6.2832 15.2962 2.7363 35.2623 12.8487 1.8397 364.4929 50.1404 9.7254 15.1284 14.3350 4.3601 23.1751 11.5144 8.4310 3.3008 1.6202 2.0954 1.9658 46.6350 7.9762 56.6828 69.3896 131.9433 7.7645 12.9567 14.5594 52.8900 2.9661 489.4795 144.2880 65.3986 203.7999 31.5935 95.7013 13.4710 20.0662 19.6569 30.5973 37.5940 31.9528 17.5066 16.6637 46.5315 9.6356 14.6604 2.5744 14.5460 41.8372
temp: 298.150 k
press: 1.00000 atm
elementType: 17 8 8 8 7 6 6 6 6 6 6 6 6 6 6 6 6 6 1 1 1 1 1 1 1 1 1 1 1 1 1 1 1 1
symmnumber: 1
zpe: 710180.6 jmol-1
zpe.correction: 0.270493 hartree
zpe.thermalcorrener: 0.288162 hartree
zpe.thermalcorrenthalpy: 0.289106 hartree
zpe.thermalcorrgfe: 0.221699 hartree
zpe.sumelectzpe: -1244.125479 hartree
zpe.sumelectthermal: -1244.107811 hartree
zpe.sumelectthermalent: -1244.106866 hartree
zpe.sumelectthermalfe: -1244.174274 hartree
dipole: -0.1153 3.1816 1.7600
dipole: 3.6378
quadrupole: -113.2803 -108.2479 -113.7530
quadrupole: 19.1298 -2.6773 0.1808
quadrupole: -1.5199 3.5125 -1.9926 19.1298 -2.6773 0.1808
hfenergy: -1244.3959728 hartree
pointgroup: C01 [X(C13H16Cl1N1O3)]
dipole: -0.0234751 -1.3905272 0.3380572 debye
polarizability: 224.2961914|-1.4276247|180.251558|-30.6229179|17.2527338|107.3857392 unknown
InChI: InChI=1S/C13H16ClNO3/c1-9-4-5-10(14)7-12(9)15-13(16)18-8-11-3-2-6-17-11/h4-5,7,11,15H,2-3,6,8H2,1H3
charge 0 multiplicity 1
34 atoms
Cl -3.511735 3.151839 1.194782
O  5.264684 -0.506302 -0.9869
O  1.568938 -1.090608 -1.122108
O  0.796446 1.052154 -0.494556
N  -0.552096 -0.898034 -0.387879
C  3.940548 -0.856742 -0.398924
C  3.814334 -0.025888 0.898437
C  4.672932 1.230404 0.595595
C  5.836129 0.642373 -0.228409
C  2.897635 -0.523398 -1.483543
C  0.605274 -0.180411 -0.644665
C  -1.794897 -0.408051 0.09596
C  -2.84612 -1.35841 0.2966
C  -1.996491 0.969822 0.370547
C  -4.088308 -0.88412 0.773757
C  -2.638701 -2.835093 0.006717
C  -3.253497 1.378597 0.84335
C  -4.315888 0.482654 1.054665
H  3.934754 -1.94525 -0.206794
H  4.244237 -0.58828 1.746977
H  2.769359 0.228974 1.13811
H  4.091844 1.957614 0.001084
H  5.020902 1.735651 1.512153
H  6.262024 1.344545 -0.965284
H  6.645637 0.263082 0.426841
H  3.175793 -1.013129 -2.429703
H  2.800427 0.566163 -1.628853
H  -0.483071 -1.897526 -0.587996
H  -1.186382 1.683561 0.212235
H  -4.902497 -1.600477 0.931555
H  -1.83117 -3.273516 0.626904
H  -3.556112 -3.405991 0.223385
H  -2.38682 -3.022192 -1.056741
H  -5.283713 0.831984 1.423098
