program: Gaussian 09
title: 000231867
version: EM64L-G09RevD.01
frameworkgroup: C1[X(C24H20N2O4S2)]
method: RPBEPBE
basis: SDD
operation: Freq
keyword: #p
keyword: freq=noraman
keyword: PBEPBE/SDD
title: #p freq=noraman PBEPBE/SDD
converged: YES YES NO NO
title: Mulliken charges:
elementType: S S O O O O N N C C C C C C C C C C C C C C C C C C C C C C C C H H H H H H H H H H H H H H H H H H H H
charge: 0.950732 0.950731 -0.524945 -0.516072 -0.524945 -0.516071 -0.528787 -0.528787 0.359979 0.359979 0.355818 0.355817 -0.384555 -0.364071 -0.364071 -0.384556 -0.343725 -0.399205 -0.399205 -0.343724 -0.070350 -0.070350 -0.268379 -0.268378 -0.224240 -0.224241 -0.200969 -0.200969 -0.205640 -0.205640 -0.216801 -0.216801 0.240177 0.238082 0.238082 0.240177 0.285449 0.285449 0.288532 0.227371 0.227371 0.288533 0.289653 0.289654 0.285811 0.285811 0.244543 0.244543 0.242115 0.242116 0.239478 0.239478
chargesum: 0.00000
title: Mulliken charges with hydrogens summed into heavy atoms:
elementType: S S O O O O N N C C C C C C C C C C C C C C C C C C C C C C C C
charge: 0.950732 0.950731 -0.524945 -0.516072 -0.524945 -0.516071 -0.243338 -0.243338 0.359979 0.359979 0.355818 0.355817 -0.144378 -0.125989 -0.125989 -0.144378 -0.055193 -0.171835 -0.171835 -0.055192 -0.070350 -0.070350 0.021274 0.021275 0.061571 0.061570 0.043574 0.043574 0.036475 0.036476 0.022677 0.022677
polarizability: 6.86379817e+02 -5.32703655e-04 3.20922219e+02 3.06460751e+01 8.32736572e-05 2.68919277e+02
1716.lowfreq: 0.0005 0.0016 0.0020 1.8404 4.6278 7.4361 11.0397 16.1349 17.8893
frequency: 11.0394 15.7435 17.4148 25.6090 32.3783 39.3533 43.9680 50.9502 59.6839 76.6754 94.8991 104.4503 119.4945 139.8098 149.8347 157.4986 159.3725 180.0161 183.7980 202.0619 219.1961 229.1982 242.4159 242.4773 273.9571 314.5970 334.5845 345.9506 372.2435 374.0914 378.0136 402.2651 403.5734 403.7006 408.3461 416.2700 426.1786 432.5599 442.5328 471.0299 490.7184 492.2436 522.9208 539.1375 572.4015 601.8876 601.8990 626.7169 638.7157 649.9373 650.0047 676.3518 689.4068 689.5215 722.4363 743.8013 756.7531 757.2030 785.9172 788.1343 815.7295 817.1544 817.4742 822.7061 831.3575 832.5254 848.4787 850.8878 851.4161 861.5579 932.3556 932.3714 949.3707 953.3007 957.7004 958.0003 975.8577 975.8780 976.0627 976.1861 983.1429 983.2534 988.2301 1005.1903 1005.2058 1005.3792 1005.7406 1005.7537 1022.3099 1044.0094 1044.0886 1077.7090 1077.7578 1119.8790 1120.4035 1173.6760 1173.7615 1178.1591 1178.3260 1188.5854 1192.2188 1225.9160 1226.3952 1246.1161 1255.3899 1296.6306 1303.1888 1303.2064 1305.2383 1320.7265 1365.3141 1380.4191 1383.2747 1383.2857 1429.2429 1432.9895 1436.4623 1436.4964 1449.8964 1449.9729 1478.5838 1515.6995 1547.2790 1565.6757 1574.6184 1574.7436 1598.7794 1600.8441 1600.8884 1613.6516 3120.0515 3120.0534 3138.2909 3138.2948 3140.2502 3142.6573 3147.7607 3147.7700 3148.3679 3150.5988 3156.9802 3156.9854 3166.5987 3166.6116 3175.9822 3176.0449 3179.8105 3180.0411 3385.4085 3385.4264
redmass: 6.9401 6.2262 6.3508 5.3157 5.8103 4.6082 3.9147 5.4985 6.0623 6.8682 5.0917 5.5626 7.6763 7.9081 6.7605 9.3961 5.4147 10.5002 5.9268 10.1756 6.0251 7.7044 9.3094 9.2208 6.7662 6.3725 7.1837 6.3224 4.2208 9.4659 8.2350 4.3124 2.8392 2.8350 3.9424 3.0227 2.8664 8.1946 7.6523 3.3538 4.4668 4.3864 3.0184 4.1680 3.0362 6.4810 6.4798 6.2734 6.3809 7.0104 7.0181 5.7998 2.5068 2.5051 3.3780 3.1164 1.4027 1.3848 2.0781 1.9145 3.7088 3.4559 2.4618 1.7290 4.2448 1.6182 1.6957 1.2458 1.2479 1.7187 1.3416 1.3416 1.5167 1.5169 5.4527 4.8782 1.5991 5.5659 4.2738 1.4775 1.4041 1.3969 5.7442 1.3382 1.5269 2.2792 4.6499 4.6205 2.3561 2.0299 2.0300 1.5519 1.5517 1.5586 1.3357 1.0564 1.0565 1.1224 1.1226 1.1470 1.2822 1.2069 1.2022 3.5141 2.8097 3.1633 1.2998 1.3004 1.4955 1.3122 2.1042 5.7543 8.5199 8.5202 4.4699 3.0871 2.2489 2.2518 2.0196 2.0189 2.2633 2.9057 5.6034 6.8784 5.8057 5.8009 5.7923 6.9018 6.8873 6.2236 1.0879 1.0878 1.0857 1.0857 1.0916 1.0897 1.0886 1.0886 1.0949 1.0939 1.0929 1.0929 1.0967 1.0967 1.1013 1.1013 1.0956 1.0957 1.0757 1.0757
irintensity: 1.0280 0.3293 2.1412 1.2434 0.0909 0.0932 1.2240 4.5362 0.6969 9.6512 0.0644 2.5393 14.8585 0.6913 9.4288 0.0435 0.5148 53.2022 0.2536 0.0979 30.1188 10.8493 9.6224 1.1739 0.8372 0.4371 7.9066 0.0600 20.5745 27.4028 4.8804 24.2347 0.3286 0.0000 0.5818 8.7380 10.2068 92.7223 47.0468 45.4402 87.7884 123.7526 14.2190 1.0351 25.7559 0.0492 0.0018 5.3231 3.3044 4.6644 0.3511 3.1368 50.7627 11.0247 0.0846 14.0492 84.6939 8.6413 41.0801 47.2513 344.1001 120.0462 11.6542 117.2368 0.0036 42.5536 10.7126 0.5099 1.0701 21.2645 1.9097 0.0502 0.0963 7.8633 101.1260 0.2769 0.1151 10.5049 6.1833 0.5284 0.2105 0.1996 4.4770 0.3444 0.5927 0.1607 2.6435 1.1544 0.0760 3.6440 31.6602 9.5016 0.0098 18.8190 1.4851 0.1572 0.0255 10.8369 8.8642 7.0944 6.1102 0.0065 1.4882 4.2905 0.1366 0.0313 6.7416 0.0344 4.0267 0.1008 10.0109 1.1264 12.0228 0.2110 9.2277 0.5034 30.8791 0.0488 0.8117 25.4558 89.3792 0.0001 0.6789 0.5453 12.9041 8.3144 0.0711 1.0182 0.0051 7.7291 28.1527 5.3007 1.3123 1.1190 3.9095 11.6970 14.7836 0.6601 22.1092 0.3225 2.9349 1.2374 8.0731 4.2888 2.1191 42.4024 0.1363 0.9269 11.8131 17.6681
temp: 298.150 k
press: 1.00000 atm
elementType: 16 16 8 8 8 8 7 7 6 6 6 6 6 6 6 6 6 6 6 6 6 6 6 6 6 6 6 6 6 6 6 6 1 1 1 1 1 1 1 1 1 1 1 1 1 1 1 1 1 1 1 1
symmnumber: 1
zpe: 1000840.1 jmol-1
zpe.correction: 0.381200 hartree
zpe.thermalcorrener: 0.411131 hartree
zpe.thermalcorrenthalpy: 0.412075 hartree
zpe.thermalcorrgfe: 0.315337 hartree
zpe.sumelectzpe: -2130.483080 hartree
zpe.sumelectthermal: -2130.453150 hartree
zpe.sumelectthermalent: -2130.452205 hartree
zpe.sumelectthermalfe: -2130.548943 hartree
dipole: -0.0001 8.3318 0.0000
dipole: 8.3318
quadrupole: -284.9512 -186.9148 -192.5801
quadrupole: -0.0004 50.7072 0.0001
quadrupole: -63.4692 34.5673 28.9019 -0.0004 50.7072 0.0001
hfenergy: -2130.8642803 hartree
pointgroup: C01 [X(C24H20N2O4S2)]
dipole: 0.0000546 3.2779682 -0.0000365 debye
polarizability: 686.6540643|-0.0096725|320.9222196|28.7161807|-0.0011186|268.6450288 unknown
InChI: InChI=1S/C24H20N2O4S2/c27-31(28,23-7-3-1-4-8-23)25-21-15-11-19(12-16-21)20-13-17-22(18-14-20)26-32(29,30)24-9-5-2-6-10-24/h1-18,25-26H
charge 0 multiplicity 1
52 atoms
S  6.061898 -0.593043 -0.567378
S  -6.061903 -0.592734 0.567426
O  7.576851 -0.829969 -0.032468
O  5.615083 -0.79169 -2.114806
O  -7.576869 -0.829605 0.03253
O  -5.615087 -0.791376 2.114855
N  5.001582 -1.89922 0.454112
N  -5.001649 -1.898975 -0.454049
C  0.739055 -1.779828 0.068695
C  -0.739116 -1.779791 -0.068636
C  3.593963 -1.804602 0.336781
C  -3.594025 -1.804424 -0.33672
C  1.585652 -2.084046 -1.039347
C  -1.363665 -1.482964 -1.314691
C  1.36362 -1.483007 1.314744
C  -1.585728 -2.083942 1.039413
C  2.983404 -2.110831 -0.914524
C  -2.762576 -1.468735 -1.444978
C  2.762532 -1.468849 1.445031
C  -2.983481 -2.110658 0.914591
C  5.524882 1.151427 -0.04208
C  -5.524817 1.151704 0.042094
C  6.24234 1.770133 0.995866
C  -6.242259 1.770423 -0.995855
C  4.443377 1.744006 -0.714988
C  -4.443278 1.744248 0.71498
C  5.838164 3.068218 1.384845
C  -5.838032 3.068484 -1.384861
C  4.053234 3.040803 -0.305993
C  -4.053084 3.041022 0.305959
C  4.74514 3.695881 0.74019
C  -4.744973 3.696111 -0.740229
H  1.139154 -2.360314 -2.000583
H  -0.74783 -1.215283 -2.180124
H  0.747798 -1.215276 2.180171
H  -1.139244 -2.360212 2.000655
H  5.366116 -1.799691 1.419533
H  -5.366178 -1.799441 -1.419471
H  3.620622 -2.387347 -1.759017
H  -3.219486 -1.206116 -2.407495
H  3.219454 -1.206232 2.407543
H  -3.620713 -2.387124 1.75909
H  7.100996 1.268256 1.454299
H  -7.100942 1.268576 -1.454269
H  3.945985 1.222498 -1.538691
H  -3.9459 1.222734 1.538687
H  6.380129 3.587678 2.181906
H  -6.379982 3.587953 -2.181926
H  3.21664 3.536586 -0.809025
H  -3.216463 3.536777 0.808973
H  4.439777 4.702048 1.046928
H  -4.439569 4.702259 -1.046988
