program: Gaussian 09
title: 000231810
version: EM64L-G09RevD.01
frameworkgroup: C1[X(C13H4Cl7NO2)]
method: RPBEPBE
basis: SDD
operation: Freq
keyword: #p
keyword: freq=noraman
keyword: PBEPBE/SDD
title: #p freq=noraman PBEPBE/SDD
converged: NO YES NO YES
title: Mulliken charges:
elementType: Cl Cl Cl Cl Cl Cl Cl O O N C C C C C C C C C C C C C H H H H
charge: 0.060676 0.060681 0.065481 0.065482 0.071880 -0.004568 0.000776 -0.333494 -0.211692 -0.456283 0.745180 0.545136 -0.310639 -0.310646 -0.086503 -0.086504 -0.117508 -0.449143 -0.345606 0.250259 -0.031354 -0.177097 -0.120389 0.350152 0.259654 0.304423 0.261646
chargesum: 0.00000
title: Mulliken charges with hydrogens summed into heavy atoms:
elementType: Cl Cl Cl Cl Cl Cl Cl O O N C C C C C C C C C C C C C
charge: 0.060676 0.060681 0.065481 0.065482 0.071880 -0.004568 0.000776 -0.333494 -0.211692 -0.106131 0.745180 0.545136 -0.310639 -0.310646 -0.086503 -0.086504 -0.117508 -0.189489 -0.041183 0.250259 -0.031354 0.084549 -0.120389
polarizability: 3.69400419e+02 1.91634727e-02 1.94557488e+02 -2.06322316e+01 3.58472687e-03 1.50051514e+02
1716.lowfreq: -3.6176 -2.7982 -0.0012 0.0013 0.0024 2.6563 9.1817 14.9580 24.4640
frequency: 8.8182 14.9371 24.4615 45.3643 65.5813 67.0658 70.6836 86.3114 107.0831 124.9551 153.4687 183.9830 194.7552 197.8477 201.1624 202.4154 213.4804 217.7732 253.8678 290.0466 314.5671 317.2706 324.9724 333.7652 346.8461 359.6440 360.8950 433.4630 439.4570 440.0526 521.1017 573.5876 579.4084 592.5429 611.0937 642.1286 649.4635 663.2123 674.9399 692.1517 695.0163 698.5148 748.4569 789.0244 824.6978 832.1257 866.1139 867.2741 886.4850 961.5472 968.6222 999.2241 1068.3110 1123.2597 1136.3872 1154.6626 1230.9210 1240.9366 1284.7578 1329.0958 1337.0590 1350.9470 1369.8826 1394.8306 1467.9825 1507.7766 1535.7065 1546.9014 1584.3730 1607.3821 1717.0154 3149.1454 3167.5062 3196.8554 3539.3577
redmass: 17.5675 14.3806 21.0064 14.6382 17.3515 18.1389 12.4241 22.5017 18.9130 6.0326 15.3104 27.7869 6.3829 25.1394 27.4539 17.4706 34.7153 20.2697 13.7083 18.2745 18.8356 12.3765 25.5661 6.4243 15.8567 16.6754 12.9120 10.6428 3.1094 7.6344 11.5574 4.3216 11.3853 12.0815 12.3032 2.1794 7.7530 7.9948 9.6065 3.0927 2.6758 11.9266 11.1042 11.8047 12.5930 1.3315 1.6146 6.2145 10.6390 11.6844 1.3216 5.2469 11.8095 2.3892 3.6251 1.3628 5.4554 1.7250 2.1169 12.0389 12.0120 5.3850 6.8207 4.2018 2.7759 2.4249 11.9989 10.5266 4.7334 6.5223 10.2698 1.0926 1.0907 1.0957 1.0764
irintensity: 0.0303 0.0091 0.0165 0.0053 1.6974 0.2368 3.5117 0.4612 0.3947 0.2124 2.8537 0.0343 2.0709 0.5255 0.3181 1.0665 0.0007 1.3848 3.1828 0.3146 0.1086 0.0001 0.8674 0.0329 2.9541 1.2483 4.6008 29.2192 8.9509 13.0172 3.2607 16.6486 6.9234 0.0332 7.1709 32.1737 15.7887 38.7757 3.6811 19.1578 51.9375 10.3145 76.4449 3.6076 0.2513 21.7657 58.3842 46.5273 110.8224 379.3580 1.3323 19.0410 160.7558 130.8947 378.6215 0.5267 8.6028 1.0533 11.6490 125.2231 39.0394 549.0932 58.3849 17.6865 116.8222 499.3874 0.4826 14.8827 99.4357 117.1392 310.0694 3.4879 0.9126 4.9558 44.1021
temp: 298.150 k
press: 1.00000 atm
elementType: 17 17 17 17 17 17 17 8 8 7 6 6 6 6 6 6 6 6 6 6 6 6 6 1 1 1 1
symmnumber: 1
zpe: 369483.3 jmol-1
zpe.correction: 0.140729 hartree
zpe.thermalcorrener: 0.163179 hartree
zpe.thermalcorrenthalpy: 0.164124 hartree
zpe.thermalcorrgfe: 0.083563 hartree
zpe.sumelectzpe: -3921.764310 hartree
zpe.sumelectthermal: -3921.741860 hartree
zpe.sumelectthermalent: -3921.740916 hartree
zpe.sumelectthermalfe: -3921.821476 hartree
dipole: -0.7099 -0.0007 -1.6444
dipole: 1.7911
quadrupole: -198.8435 -180.9632 -173.6380
quadrupole: -0.0026 0.1367 0.0021
quadrupole: -14.3619 3.5183 10.8436 -0.0026 0.1367 0.0021
hfenergy: -3921.9050391 hartree
pointgroup: C01 [X(C13H4Cl7N1O2)]
dipole: 0.2875371 -0.0004908 0.6433397 debye
polarizability: 368.8383149|-0.0275005|194.5574898|-23.4236907|0.0103633|150.6136153 unknown
InChI: InChI=1S/C13H4Cl7NO2/c14-5-2-1-4(3-6(5)15)21-13(22)23-12-10(19)8(17)7(16)9(18)11(12)20/h1-3,21H
charge 0 multiplicity 1
27 atoms
Cl 1.815487 2.75359 0.618333
Cl 1.81652 -2.754666 0.616437
Cl 4.936987 -2.78544 -0.263676
Cl 4.935946 2.786142 -0.261749
Cl 6.486222 0.00079 -0.698066
Cl -6.582973 0.000319 1.827363
Cl -7.188983 0.001611 -1.414417
O  0.715688 -0.000889 1.029282
O  -0.121873 -0.000032 -1.197305
N  -1.520991 -0.000652 0.724515
C  2.04066 -0.000478 0.564041
C  -2.833157 -0.000095 0.177169
C  2.718741 1.222867 0.368352
C  2.719198 -1.223434 0.367505
C  4.077793 -1.227452 -0.018713
C  4.077333 1.227663 -0.017866
C  4.7576 0.000299 -0.209837
C  -3.915427 -0.000129 1.092878
C  -3.087381 0.000465 -1.219076
C  -0.334957 -0.000705 0.028687
C  -5.238658 0.000387 0.616696
C  -4.419251 0.000977 -1.676405
C  -5.499829 0.000942 -0.770512
H  -1.428347 -0.001027 1.743169
H  -3.739279 -0.000556 2.173892
H  -2.259206 0.000497 -1.929756
H  -4.626061 0.00141 -2.750543
