program: Gaussian 09
title: 000231802
version: EM64L-G09RevD.01
frameworkgroup: C1[X(C13H4Cl7NO2)]
method: RPBEPBE
basis: SDD
operation: Freq
keyword: #p
keyword: freq=noraman
keyword: PBEPBE/SDD
title: #p freq=noraman PBEPBE/SDD
converged: NO NO NO NO
title: Mulliken charges:
elementType: Cl Cl Cl Cl Cl Cl Cl O O N C C C C C C C C C C C C C H H H H
charge: 0.061552 0.061553 0.064547 0.064548 0.070886 -0.039738 -0.034934 -0.327862 -0.213904 -0.439501 0.748153 0.630803 -0.311880 -0.311896 -0.085926 -0.085929 -0.117260 -0.354585 -0.299289 0.247428 -0.202065 -0.211660 -0.116563 0.350634 0.306527 0.283428 0.262934
chargesum: 0.00000
title: Mulliken charges with hydrogens summed into heavy atoms:
elementType: Cl Cl Cl Cl Cl Cl Cl O O N C C C C C C C C C C C C C
charge: 0.061552 0.061553 0.064547 0.064548 0.070886 -0.039738 -0.034934 -0.327862 -0.213904 -0.088867 0.748153 0.630803 -0.311880 -0.311896 -0.085926 -0.085929 -0.117260 -0.354585 0.007238 0.247428 0.081364 0.051275 -0.116563
polarizability: 3.55070470e+02 -6.71924355e-03 1.94202778e+02 -6.33832385e+00 -5.43288236e-03 1.61775974e+02
1716.lowfreq: -4.4909 -4.0011 0.0011 0.0017 0.0022 3.3339 8.8321 16.6133 24.7223
frequency: 7.8552 16.6126 24.7025 43.2125 65.4916 66.7889 76.3533 84.9220 104.9628 149.1055 149.8387 165.6193 186.8840 197.8484 200.9366 203.0515 213.4123 222.6963 261.6427 290.0998 315.0480 317.5075 325.5722 347.0445 349.4322 359.6099 367.9501 395.5512 439.4950 443.4139 515.7989 549.5303 581.0851 592.5420 610.9620 643.7941 654.6699 667.5776 694.1888 698.9134 699.2613 735.2876 747.5347 789.3220 824.2876 836.2896 843.3011 861.3401 884.6872 955.9544 968.6731 1023.7736 1068.6277 1085.5795 1135.0332 1155.1945 1231.3296 1243.0148 1295.0994 1328.8153 1336.5290 1351.5679 1370.7736 1394.1723 1453.3270 1508.8059 1535.5209 1546.4967 1576.6601 1609.3773 1712.0527 3171.8854 3183.0126 3190.3661 3491.7814
redmass: 19.5787 15.8813 20.5294 14.0019 19.9742 27.3293 9.6111 26.9769 21.9317 6.4270 16.3789 6.0446 19.1665 24.3877 30.7946 19.7007 34.7733 18.7760 12.3647 18.8659 21.0392 12.6781 27.2179 6.5950 17.7544 19.4314 10.3276 11.9072 3.4309 7.0647 12.0431 4.0117 11.3808 12.0868 12.8658 7.9034 5.9520 6.0975 11.2912 11.3419 3.2597 1.6400 10.7941 11.7814 12.4448 1.3858 6.4737 1.3870 9.4425 12.0554 1.3254 4.2231 11.5655 2.4617 2.7631 1.5721 7.6711 1.6343 1.8039 12.0387 12.0114 6.8788 6.9704 5.0003 2.2800 2.7763 11.9987 10.5783 5.4594 6.4352 10.2299 1.0899 1.0935 1.0966 1.0762
irintensity: 0.0002 0.0008 0.0019 0.0219 0.2234 0.2524 3.9210 0.3913 0.3276 0.7047 1.9922 0.1777 0.3636 0.5465 0.0871 1.1812 0.0000 2.2556 2.4533 0.1106 0.0175 0.0053 0.7475 1.1100 1.9667 0.2288 11.3045 32.2335 11.1806 3.8836 2.6983 14.4070 5.0661 0.0316 8.5714 9.8397 37.5406 29.8954 9.6232 28.2416 6.9664 69.2147 43.2182 4.5771 0.2043 48.4865 23.4922 21.8532 156.4908 392.5105 2.3329 23.2444 153.0841 28.0648 339.2271 66.1509 4.1115 8.7656 28.2152 126.8930 36.9432 537.7135 47.6352 10.1219 33.5268 734.8763 0.4532 29.3833 59.8505 66.7373 313.5449 1.6621 1.6268 5.1537 79.6241
temp: 298.150 k
press: 1.00000 atm
elementType: 17 17 17 17 17 17 17 8 8 7 6 6 6 6 6 6 6 6 6 6 6 6 6 1 1 1 1
symmnumber: 1
zpe: 369325.8 jmol-1
zpe.correction: 0.140669 hartree
zpe.thermalcorrener: 0.163104 hartree
zpe.thermalcorrenthalpy: 0.164049 hartree
zpe.thermalcorrgfe: 0.083590 hartree
zpe.sumelectzpe: -3921.768902 hartree
zpe.sumelectthermal: -3921.746466 hartree
zpe.sumelectthermalent: -3921.745522 hartree
zpe.sumelectthermalfe: -3921.825981 hartree
dipole: -0.7611 -0.0003 1.0772
dipole: 1.3189
quadrupole: -182.9103 -180.9583 -177.3939
quadrupole: 0.0008 -1.5004 -0.0009
quadrupole: -2.4895 -0.5375 3.0269 0.0008 -1.5004 -0.0009
hfenergy: -3921.9095708 hartree
pointgroup: C01 [X(C13H4Cl7N1O2)]
dipole: 0.29637 0.0000833 -0.4259469 debye
polarizability: 354.9694046|0.0137844|194.2027662|-7.7265355|0.0208598|161.8770514 unknown
InChI: InChI=1S/C13H4Cl7NO2/c14-4-1-2-6(5(15)3-4)21-13(22)23-12-10(19)8(17)7(16)9(18)11(12)20/h1-3,21H
charge 0 multiplicity 1
27 atoms
Cl -1.692788 2.754486 -0.568069
Cl -1.693208 -2.754329 -0.569982
Cl -4.817338 -2.786212 0.29887
Cl -4.816905 2.786239 0.300835
Cl -6.368927 -0.000014 0.728904
Cl 3.775444 0.00079 -2.808825
Cl 7.308519 -0.000062 1.47518
O  -0.592381 0.000128 -0.980034
O  0.24064 -0.000458 1.246483
N  1.642466 0.000065 -0.673741
C  -1.91835 0.000078 -0.517118
C  2.946466 0.000024 -0.123346
C  -2.596934 1.223389 -0.322737
C  -2.597123 -1.223265 -0.323597
C  -3.957148 -1.227536 0.058042
C  -3.956957 1.227601 0.058906
C  -4.637884 0.000019 0.247276
C  4.062264 0.000339 -1.00405
C  3.203956 -0.000324 1.273778
C  0.455624 -0.000202 0.019949
C  5.386969 0.000318 -0.539556
C  4.52625 -0.00035 1.760703
C  5.602158 -0.000029 0.852533
H  1.568252 0.000329 -1.696772
H  2.360413 -0.000573 1.967271
H  6.222895 0.000566 -1.243105
H  4.711429 -0.00062 2.838197
