program: Gaussian 09
title: 000231772
version: EM64L-G09RevD.01
frameworkgroup: C1[X(C15H16O2)]
method: RPBEPBE
basis: SDD
operation: Freq
keyword: #pfreq=noraman
keyword: PBEPBE/SDD
title: #p freq=noraman PBEPBE/SDD
converged: YES YES NO NO
title: Mulliken charges:
elementType: O O C C C C C C C C C C C C C C C H H H H H H H H H H H H H H H H
charge: -0.425941 -0.457089 -0.508460 -0.283865 -0.208273 0.470805 0.490708 -0.395946 -0.371612 -0.385261 -0.436134 -0.238442 -0.226444 -0.239498 -0.232159 -0.237126 -0.241731 0.181904 0.258302 0.257869 0.223372 0.241272 0.259696 0.230772 0.239565 0.332248 0.333014 0.231126 0.223967 0.227803 0.226492 0.232209 0.226858
chargesum: 0.00000
title: Mulliken charges with hydrogens summed into heavy atoms:
elementType: O O C C C C C C C C C C C C C C C
charge: -0.093694 -0.124075 -0.068253 -0.025996 0.015100 0.470805 0.490708 -0.154674 -0.111917 -0.154489 -0.196569 -0.007317 -0.002478 -0.011696 -0.005667 -0.004917 -0.014872
polarizability: 1.85559805e+02 2.92491775e+00 1.75720676e+02 -3.49030329e+01 5.42951650e+00 1.11819604e+02
1716.lowfreq: -8.2839 -3.3794 -0.0005 0.0001 0.0002 10.5152 18.7913 25.5840 42.8417
frequency: 18.3506 25.5351 42.6151 60.7261 75.6289 147.1002 164.3219 200.7428 224.9529 237.4983 265.8121 287.8805 300.6041 330.7121 400.0971 401.1331 404.4070 415.4926 507.9998 551.1380 557.2437 582.9694 597.5090 616.4873 617.5330 703.8201 705.9319 743.5427 766.6598 771.2306 782.7344 853.7275 857.9318 910.2866 921.8255 929.5026 954.3469 978.0804 978.7622 981.9018 989.8950 990.7635 995.8925 998.2255 1017.3222 1026.5770 1035.7539 1060.5569 1080.2524 1095.2455 1151.2425 1166.4572 1172.0799 1174.3246 1185.9256 1190.3103 1196.6676 1213.4214 1226.0530 1287.1856 1312.7519 1316.2050 1326.4996 1355.1628 1367.8268 1380.2982 1389.0694 1403.2924 1442.0350 1444.3511 1464.5818 1483.7640 1486.1599 1592.1428 1595.6344 1611.4853 1615.6198 2957.3843 2968.2447 3050.6131 3063.8450 3116.9086 3117.6248 3123.2923 3126.4234 3135.4475 3139.2597 3146.6404 3153.7635 3164.4784 3165.5139 3545.6081 3552.0591
redmass: 3.9705 4.9131 3.9986 5.0345 5.7262 4.3331 4.6202 4.4549 2.3679 1.3235 1.8218 3.2293 1.9171 4.0778 3.9817 3.3355 2.9202 4.2387 3.8899 3.1831 3.4596 2.5884 4.5954 6.3652 6.2790 1.7602 1.7543 3.0387 2.7721 1.9210 2.5099 1.2505 1.2460 3.0976 1.4545 1.9198 1.9963 1.5575 1.5530 2.7762 5.9447 5.2409 1.3774 1.3200 3.2351 2.1609 2.2310 2.4978 1.5977 1.8641 1.3853 1.2383 1.0582 1.0582 1.1211 1.1178 1.5370 1.8858 1.4849 1.2734 1.3615 1.3832 1.2827 1.3989 1.4069 5.0274 3.4497 1.7961 2.1054 2.0519 1.1135 2.2658 2.3422 5.9088 6.1127 6.0887 6.1006 1.0677 1.0834 1.0889 1.0911 1.0860 1.0857 1.0869 1.0875 1.0910 1.0927 1.0959 1.0959 1.1014 1.1001 1.0663 1.0659
irintensity: 0.0391 0.1274 0.1690 0.6858 0.7108 2.9480 1.8117 2.3905 41.0563 64.4934 58.1448 11.8944 114.2713 4.5265 0.5106 0.1963 0.7514 0.4490 2.3079 24.1389 13.6284 5.9385 24.7081 0.4161 0.0468 102.6181 12.7986 38.2608 27.6601 51.8139 10.6668 0.3072 0.8749 84.9878 9.3610 12.2259 35.8395 8.2952 7.4305 38.5158 0.1073 0.6563 1.7205 0.4044 13.6257 6.5320 3.0240 15.2681 2.9008 4.9620 39.3341 45.5228 3.2929 1.3404 5.3085 0.6079 34.1975 22.8746 7.5678 3.9815 14.6023 10.7534 1.7233 4.2471 28.6668 3.8592 6.0087 13.2539 4.6180 20.4270 10.3372 5.5776 10.9484 1.3372 0.3675 0.8921 2.1735 43.4224 39.3436 7.2433 33.0447 7.7282 7.0866 2.9922 2.2731 11.8281 30.7626 35.3801 27.4099 22.8687 13.5061 7.3389 7.5136
temp: 298.150 k
press: 1.00000 atm
elementType: 8 8 6 6 6 6 6 6 6 6 6 6 6 6 6 6 6 1 1 1 1 1 1 1 1 1 1 1 1 1 1 1 1
symmnumber: 1
zpe: 707249.7 jmol-1
zpe.correction: 0.269377 hartree
zpe.thermalcorrener: 0.285079 hartree
zpe.thermalcorrenthalpy: 0.286023 hartree
zpe.thermalcorrgfe: 0.224216 hartree
zpe.sumelectzpe: -730.392827 hartree
zpe.sumelectthermal: -730.377125 hartree
zpe.sumelectthermalent: -730.376181 hartree
zpe.sumelectthermalfe: -730.437988 hartree
dipole: 2.6426 -0.0433 -1.1652
dipole: 2.8884
quadrupole: -94.1835 -86.1280 -111.2355
quadrupole: -4.4905 -10.9980 3.3267
quadrupole: 2.9989 11.0543 -14.0532 -4.4905 -10.9980 3.3267
hfenergy: -730.6622041 hartree
pointgroup: C01 [X(C15H16O2)]
dipole: 1.0317637 0.014464 0.4760563 debye
polarizability: 184.4791739|-4.0987174|175.1858291|35.8968816|7.9184835|113.435082 unknown
InChI: InChI=1S/C15H16O2/c16-14(12-7-3-1-4-8-12)11-15(17)13-9-5-2-6-10-13/h1-10,14-17H,11H2
charge 0 multiplicity 1
33 atoms
O  1.226392 1.602344 -2.34817
O  -1.653692 2.276197 1.618825
C  -0.133195 1.878017 -0.294477
C  0.700425 0.896025 -1.146752
C  -0.885998 1.23209 0.901535
C  1.832076 0.180344 -0.41165
C  -1.890198 0.175007 0.46381
C  2.115303 -1.175874 -0.714068
C  -3.138985 0.562096 -0.083398
C  2.658787 0.852922 0.526389
C  -1.577905 -1.202298 0.56724
C  3.195215 -1.846045 -0.098895
C  -4.057344 -0.415011 -0.525348
C  3.74326 0.187863 1.141708
C  -2.49441 -2.181502 0.11955
C  4.014543 -1.164826 0.831709
C  -3.736627 -1.790274 -0.430179
H  0.522352 2.687829 0.093377
H  -0.873659 2.354839 -0.962665
H  0.022217 0.145626 -1.586848
H  -0.146968 0.773629 1.591902
H  1.486396 -1.702016 -1.442547
H  -3.391749 1.626357 -0.12789
H  2.460103 1.900299 0.785455
H  -0.621144 -1.51132 1.006598
H  2.002689 2.154662 -2.071396
H  -1.040048 3.020697 1.846709
H  3.398797 -2.894383 -0.344104
H  -5.024287 -0.106837 -0.939251
H  4.372523 0.720788 1.863522
H  -2.243568 -3.244684 0.20791
H  4.853177 -1.682431 1.310535
H  -4.450778 -2.547731 -0.772734
