program: Gaussian 09
title: 000231770
version: EM64L-G09RevD.01
frameworkgroup: C1[X(C15H10Br2O)]
method: RPBEPBE
basis: SDD
operation: Freq
keyword: #p
keyword: freq=noraman
keyword: PBEPBE/SDD
title: #p freq=noraman PBEPBE/SDD
converged: YES YES NO NO
title: Mulliken charges:
elementType: Br Br O C C C C C C C C C C C C C C C H H H H H H H H H H
charge: 0.026848 0.029982 -0.245465 0.305805 0.494285 0.098715 -0.271853 -0.304718 -0.328918 -0.342235 -0.365629 -0.379924 -0.199443 -0.192873 -0.190256 -0.194910 -0.212704 -0.219538 0.273145 0.206220 0.224320 0.287942 0.232895 0.247728 0.253635 0.256500 0.253927 0.256519
chargesum: 0.00000
title: Mulliken charges with hydrogens summed into heavy atoms:
elementType: Br Br O C C C C C C C C C C C C C C C
charge: 0.026848 0.029982 -0.245465 0.305805 0.494285 0.098715 0.001292 -0.098498 -0.104598 -0.054292 -0.132733 -0.132196 0.054192 0.063627 0.063671 0.061608 -0.212704 -0.219538
polarizability: 4.78943196e+02 2.87879602e+00 1.91832509e+02 -8.17575271e-01 9.65814975e-02 6.87330988e+01
1716.lowfreq: -5.9336 -0.9486 -0.0007 -0.0004 0.0002 2.5781 8.9279 22.0285 30.1383
frequency: 8.5516 22.0138 30.1288 49.7605 74.5874 118.3603 126.6174 142.1776 165.6923 201.8894 247.4872 258.7858 273.1428 325.7933 335.6820 366.1945 404.0119 407.9623 467.0108 471.1831 502.5684 519.2162 607.3445 621.6534 625.2459 665.4778 689.7719 714.8802 742.9424 784.9822 824.5600 827.6232 833.9653 857.7559 877.9971 890.7637 958.5004 961.6139 973.1092 991.7011 994.5354 1001.7492 1017.5464 1026.8300 1060.0247 1063.1475 1109.4166 1115.1158 1185.2682 1192.1355 1217.5751 1223.1955 1286.7461 1298.3447 1312.4548 1331.2470 1367.4719 1374.6235 1393.7891 1401.4898 1469.4757 1475.0430 1514.5844 1564.4455 1574.2686 1589.1220 1593.7023 1635.8552 3098.5241 3137.6410 3143.5063 3147.2375 3155.0654 3158.1358 3171.7249 3174.0948 3175.4260 3177.7874
redmass: 3.6951 4.5924 14.0510 9.1054 8.0004 7.7606 4.0398 16.0231 4.1938 8.3461 11.9437 5.4607 5.5450 7.0742 4.0225 6.3050 2.8267 2.8317 6.5094 3.3846 2.7611 4.8949 7.5474 7.1236 7.0871 3.8498 7.2613 3.4375 2.8225 6.5514 1.3635 1.3052 1.4603 1.5370 4.3427 1.9760 1.3620 1.3743 1.3757 5.1353 4.6224 1.3608 1.2352 3.8764 2.6838 2.4989 1.4077 1.4011 1.1561 1.1151 3.1271 1.4156 1.3056 1.4422 1.9804 1.6545 4.1451 4.7321 3.9787 3.2515 2.3295 2.4350 10.5555 6.9851 7.5534 6.0573 6.0714 5.6169 1.0894 1.0902 1.0897 1.0890 1.0888 1.0874 1.0958 1.0958 1.0963 1.0971
irintensity: 0.0048 0.0242 0.0480 0.5276 3.0415 1.4436 0.2241 0.2455 0.5891 1.0108 5.9687 1.5069 0.4504 29.9237 0.3067 2.6688 0.0611 0.0072 18.3912 4.5863 44.4171 5.3395 0.7006 3.3066 0.7311 5.7909 6.4708 0.0420 3.0758 76.9382 68.6022 11.1973 51.6824 15.2837 3.1980 0.7613 2.0306 0.5176 0.1854 192.4707 23.0057 0.5652 42.4498 80.0601 111.7930 14.3813 6.7054 16.5434 93.6698 0.1993 190.9907 12.6285 2.2907 25.4187 175.9793 38.0133 3.4873 111.8319 16.7065 41.1035 68.8112 104.0016 195.9652 19.3862 50.3122 315.0157 16.1612 310.0822 0.4928 4.3959 2.7182 7.8342 0.9811 12.9071 7.1422 13.1384 3.6790 3.2073
temp: 298.150 k
press: 1.00000 atm
elementType: 35 35 8 6 6 6 6 6 6 6 6 6 6 6 6 6 6 6 1 1 1 1 1 1 1 1 1 1
symmnumber: 1
zpe: 525741.1 jmol-1
zpe.correction: 0.200244 hartree
zpe.thermalcorrener: 0.216631 hartree
zpe.thermalcorrenthalpy: 0.217576 hartree
zpe.thermalcorrgfe: 0.150484 hartree
zpe.sumelectzpe: -678.489625 hartree
zpe.sumelectthermal: -678.473238 hartree
zpe.sumelectthermalent: -678.472294 hartree
zpe.sumelectthermalfe: -678.539385 hartree
dipole: -1.1451 -1.7847 0.0012
dipole: 2.1205
quadrupole: -129.9082 -120.1003 -129.3806
quadrupole: -4.4264 -0.2312 0.0423
quadrupole: -3.4452 6.3628 -2.9176 -4.4264 -0.2312 0.0423
hfenergy: -678.6898691 hartree
pointgroup: C01 [X(C15H10Br2O1)]
dipole: 0.4579207 0.6881348 -0.1129245 debye
polarizability: 478.9584614|-0.5622126|188.7239522|-2.4322737|-19.2228169|71.8263898 unknown
InChI: InChI=1S/C15H10Br2O/c16-13-6-1-11(2-7-13)3-10-15(18)12-4-8-14(17)9-5-12/h1-10H
charge 0 multiplicity 1
28 atoms
Br -6.83433 1.625852 -0.205417
Br 7.062435 1.338717 -0.278753
O  -1.182943 -2.399726 0.385806
C  -2.516554 -0.418549 0.079454
C  2.613974 -0.418084 0.043877
C  -1.19735 -1.139249 0.182383
C  1.277392 -1.010134 0.15327
C  0.068151 -0.373314 0.044617
C  -2.644204 0.983938 -0.11132
C  -3.700106 -1.19943 0.184517
C  2.840968 0.967123 -0.209734
C  3.750659 -1.263759 0.197476
C  -3.914775 1.592807 -0.195132
C  -4.975294 -0.60988 0.102143
C  4.144591 1.487299 -0.305461
C  5.064032 -0.759786 0.104822
C  -5.067163 0.786974 -0.087931
C  5.246678 0.61603 -0.146442
H  1.229761 -2.092453 0.345831
H  0.017457 0.702885 -0.146461
H  -1.762903 1.626537 -0.193928
H  -3.589782 -2.278503 0.332922
H  1.994435 1.650139 -0.335425
H  3.600908 -2.332074 0.392454
H  -4.00457 2.672826 -0.3403
H  -5.878871 -1.220243 0.183597
H  4.305695 2.551189 -0.500595
H  5.924906 -1.423033 0.225331
